[gd_scene load_steps=4 format=2]

[ext_resource path="res://Assets/PNG/HUD/hudHeart_full.png" type="Texture" id=1]
[ext_resource path="res://Assets/Choice Font.tres" type="DynamicFont" id=2]
[ext_resource path="res://Scripts/Life.gd" type="Script" id=3]

[node name="GUI" type="MarginContainer"]
margin_right = 132.0
margin_bottom = 128.0
rect_scale = Vector2( 0.560001, 0.560001 )
__meta__ = {
"_edit_horizontal_guides_": [ 15.0 ]
}

[node name="HBoxContainer" type="HBoxContainer" parent="."]
margin_right = 132.0
margin_bottom = 128.0
size_flags_horizontal = 4
size_flags_vertical = 4
__meta__ = {
"_edit_lock_": true
}

[node name="TextureRect" type="TextureRect" parent="HBoxContainer"]
margin_right = 128.0
margin_bottom = 128.0
texture = ExtResource( 1 )

[node name="Life" type="Label" parent="HBoxContainer"]
margin_left = 132.0
margin_top = 34.0
margin_right = 132.0
margin_bottom = 94.0
custom_fonts/font = ExtResource( 2 )
script = ExtResource( 3 )
