[gd_scene load_steps=6 format=2]

[ext_resource path="res://Scripts/MovingPlatform.gd" type="Script" id=1]
[ext_resource path="res://Assets/Platformer Assets Base/PNG/Tiles/stoneHalfLeft.png" type="Texture" id=2]
[ext_resource path="res://Assets/Platformer Assets Base/PNG/Tiles/stoneHalfMid.png" type="Texture" id=3]
[ext_resource path="res://Assets/Platformer Assets Base/PNG/Tiles/stoneHalfRight.png" type="Texture" id=4]

[sub_resource type="RectangleShape2D" id=1]
extents = Vector2( 105, 20 )

[node name="MovingPlatform" type="Node2D"]
script = ExtResource( 1 )

[node name="Platform" type="KinematicBody2D" parent="."]

[node name="Sprite" type="Sprite" parent="Platform"]
texture = ExtResource( 2 )

[node name="Sprite2" type="Sprite" parent="Platform"]
position = Vector2( 70, 0 )
texture = ExtResource( 3 )

[node name="Sprite3" type="Sprite" parent="Platform"]
position = Vector2( 140, 0 )
texture = ExtResource( 4 )

[node name="CollisionShape2D" type="CollisionShape2D" parent="Platform"]
position = Vector2( 70, -15 )
shape = SubResource( 1 )
one_way_collision = true

[node name="MoveTween" type="Tween" parent="."]
repeat = true
playback_process_mode = 0
playback/repeat = true
