<svg id="order-history" xmlns="http://www.w3.org/2000/svg" width="34.292" height="31.016" viewBox="0 0 34.292 31.016">
  <g id="Group_59" data-name="Group 59">
    <path id="Path_102" data-name="Path 102" d="M34.291,28.693s0-.007,0-.011,0-.03,0-.044,0-.011,0-.016,0-.027-.008-.04l0-.015c0-.014-.008-.028-.013-.042l0-.008-1.363-3.488a.9.9,0,0,0-.847-.579H29.566a.49.49,0,0,0,0,.979H32l1.084,2.776H22.832l-.642-2.776h3.786a.49.49,0,0,0,0-.979H6.166a.9.9,0,0,0-.847.579L3.956,28.517l0,.008c-.005.014-.01.027-.013.042l0,.015c0,.013-.006.026-.008.04s0,.011,0,.016,0,.029,0,.044,0,.007,0,.011v7.2a.49.49,0,1,0,.979,0v-6.7H15.281v7.443a.741.741,0,0,0,1.232.555l2.593-2.3,2.593,2.3a.741.741,0,0,0,1.232-.555V29.185H33.312V51.147a.638.638,0,0,1-.637.637H23.7c0-.006,0-.011,0-.017,0-.044,0-.088-.006-.131a1.762,1.762,0,0,0,2.074-2.387c-.017-.041-.036-.081-.056-.12l-.011-.021q-.029-.056-.063-.109l-.013-.02c-.023-.036-.047-.072-.073-.106v0c-.026-.034-.053-.067-.081-.1l-.015-.018q-.041-.046-.086-.089l-.018-.017c-.031-.029-.063-.058-.1-.085l0,0c-.033-.026-.067-.051-.1-.075l-.019-.013q-.052-.035-.107-.066l-.009-.005a1.763,1.763,0,0,0-.331-2.889q-.077-.041-.159-.074L16.9,42.331l3.547-1.1a1.609,1.609,0,0,0,1.06-2.006,1.572,1.572,0,0,0-.537-.776,1.648,1.648,0,0,0-1.353-.317l-.007,0c-.027.006-2.747.618-5.587,1.171l-.37.072-.286.055-.081.015-.481.09-.186.034a22.26,22.26,0,0,1-4.847.631h0l-.012,0H7.744L7.7,40.19l-.08-.033.1-.245a.968.968,0,0,0,0-.746A.986.986,0,0,0,7.627,39a.968.968,0,0,0-.439-.355l-2.63-1.072a.975.975,0,0,0-1.271.534L.072,45.991a.976.976,0,0,0,.535,1.271l2.63,1.072A.975.975,0,0,0,4.507,47.8l.024-.059.606.247h0a5.379,5.379,0,0,1,1.577.993q.126.114.245.236t.23.252q.055.065.109.131a6.362,6.362,0,0,0,2.555,1.906l.682.278h-5a.638.638,0,0,1-.637-.637V49.908a.49.49,0,1,0-.979,0v1.239a1.618,1.618,0,0,0,1.617,1.617h7.4l6.308,2.572a1.761,1.761,0,0,0,2.417-1.82,1.819,1.819,0,0,0,.977-.129,1.746,1.746,0,0,0,.758-.623h9.277a1.618,1.618,0,0,0,1.617-1.617V28.693ZM17.029,25.429h4.155l.642,2.776h-5.44Zm-1.648,2.776H5.129l1.084-2.776h9.81ZM21.953,36.1h0L19.6,34.012a.742.742,0,0,0-.983,0L16.261,36.1V29.185h5.692ZM3.6,47.425.98,46.357l3.213-7.879,2.622,1.069ZM23.164,50.38l-.562-.229h0l-5.853-2.386a.49.49,0,0,0-.37.907l5.853,2.386a.778.778,0,0,1,.071.033l.019.011c.016.009.032.018.047.028l.021.016c.013.01.027.019.04.03l.022.02.034.031.021.023.029.032.02.026c.008.011.017.022.025.033s.012.02.018.029.014.022.021.034.011.021.016.032.012.023.017.034.009.023.013.034.009.023.013.035.007.024.01.036.007.024.01.035,0,.024.007.037,0,.024.006.037,0,.025,0,.037,0,.025,0,.037,0,.025,0,.037,0,.025,0,.038,0,.024,0,.036,0,.026,0,.039,0,.024-.007.036-.005.026-.009.04-.007.023-.011.035-.008.026-.013.039l-.012.027,0,.006a.761.761,0,0,1-.4.4.829.829,0,0,1-.638.008l-1.037-.423-.015-.005-.014-.007-4.76-1.941a.49.49,0,0,0-.37.907l4.76,1.941.015.005.014.006a.783.783,0,0,1-.591,1.449l-6.4-2.608h0l-3-1.221a5.38,5.38,0,0,1-2.161-1.612,6.36,6.36,0,0,0-2.555-1.906h0L4.9,46.833l1.209-2.966,1.143-2.8.084.034a1.272,1.272,0,0,0,.5.09,12.7,12.7,0,0,0,2.138-.182c.767-.108,1.708-.265,2.807-.467l.081-.015.155-.029.122-.023.141-.026.152-.029.123-.023.189-.036.1-.019.3-.057c2.83-.551,5.562-1.163,5.685-1.191l.037-.006a.643.643,0,0,1,.713.429.628.628,0,0,1-.413.783L15.3,41.8a.49.49,0,0,0-.04.921l8.888,3.624a.783.783,0,0,1-.291,1.507h0c-.024,0-.048,0-.071,0l-.021,0-.054-.008-.034-.008-.041-.01-.041-.014-.033-.011-5.853-2.387a.49.49,0,0,0-.37.907l7.1,2.894a.787.787,0,0,1,.137.072.783.783,0,0,1,.318.875q-.011.037-.026.073a.787.787,0,0,1-.034.072.8.8,0,0,1-.181.225l-.013.012a.787.787,0,0,1-.792.12Z" transform="translate(0 -24.45)" fill="#e30613"/>
  </g>
</svg>
