<svg xmlns="http://www.w3.org/2000/svg" width="33.353" height="33.55" viewBox="0 0 33.353 33.55">
  <g id="feature1" transform="translate(-14.56 -11.136)">
    <g id="Group_40" data-name="Group 40" transform="translate(15.563 12.138)">
      <path id="Path_138" data-name="Path 138" d="M272.733,254.321s.665-.372.608.327-1.476,7.256,6.129,7.481c.135,0,.71.09.2.575C274.006,268.112,264.813,260.27,272.733,254.321Z" transform="translate(-248.533 -232.972)" fill="none" stroke="#e30613" stroke-linecap="round" stroke-width="2"/>
      <circle id="Ellipse_2" data-name="Ellipse 2" cx="6.354" cy="6.354" r="6.354" transform="translate(5.772 14.667) rotate(-45)" fill="none" stroke="#e30613" stroke-linecap="round" stroke-width="2"/>
      <line id="Line_5" data-name="Line 5" x2="4" y2="0.011" transform="translate(0 15.717)" fill="none" stroke="#e30613" stroke-linecap="round" stroke-width="2"/>
      <line id="Line_6" data-name="Line 6" x2="3.988" transform="translate(25.665 15.739)" fill="none" stroke="#e30613" stroke-linecap="round" stroke-width="2"/>
      <line id="Line_7" data-name="Line 7" y2="3.988" transform="translate(14.77 25.372)" fill="none" stroke="#e30613" stroke-linecap="round" stroke-width="2"/>
      <line id="Line_8" data-name="Line 8" x1="0.011" y2="4" transform="translate(14.782)" fill="none" stroke="#e30613" stroke-linecap="round" stroke-width="2"/>
      <line id="Line_9" data-name="Line 9" y1="2.828" x2="2.828" transform="translate(5.081 23.074)" fill="none" stroke="#e30613" stroke-linecap="round" stroke-width="2"/>
      <line id="Line_10" data-name="Line 10" y1="2.817" x2="2.828" transform="translate(23.231 4.946)" fill="none" stroke="#e30613" stroke-linecap="round" stroke-width="2"/>
      <line id="Line_11" data-name="Line 11" x2="2.828" y2="2.828" transform="translate(4.8 4.709)" fill="none" stroke="#e30613" stroke-linecap="round" stroke-width="2"/>
    </g>
  </g>
</svg>
