<svg xmlns="http://www.w3.org/2000/svg" width="15" height="15" viewBox="0 0 15 15">
  <g id="plus" transform="translate(-347.548 -14.653)">
    <line id="Line_7" data-name="Line 7" y2="15" transform="translate(354.779 14.653)" fill="none" stroke="#e30613" stroke-width="3"/>
    <line id="Line_8" data-name="Line 8" x1="15" transform="translate(347.548 22.178)" fill="none" stroke="#e30613" stroke-width="3"/>
  </g>
</svg>
