<svg xmlns="http://www.w3.org/2000/svg" width="91.742" height="73.751" viewBox="0 0 91.742 73.751">
  <g id="pipe" transform="matrix(0.995, -0.105, 0.105, 0.995, -946.4, -830.519)">
    <path id="Union_1" data-name="Union 1" d="M3.453,12.506A6.665,6.665,0,1,1,11,1.6L80.809,52.85,72.755,63.51Z" transform="translate(854.313 934.315)" fill="#fff" stroke="#e30613" stroke-width="1.63"/>
    <g id="Ellipse_18" data-name="Ellipse 18" transform="translate(923.6 985.021)" fill="#fff" stroke="#e30613" stroke-width="1.63">
      <circle cx="7.57" cy="7.57" r="7.57" stroke="none"/>
      <circle cx="7.57" cy="7.57" r="6.755" fill="none"/>
    </g>
    <path id="Path_212" data-name="Path 212" d="M3.591,0A6.487,6.487,0,0,0,.3,7.806,6.723,6.723,0,0,0,7.307,12.9" transform="translate(921.716 975.554) rotate(60)" fill="none" stroke="#e30613" stroke-width="1.63"/>
    <path id="Path_240" data-name="Path 240" d="M3.423,0S-1.218,1.891.308,7.492,7.475,12.7,7.475,12.7" transform="translate(905.409 963.639) rotate(60)" fill="none" stroke="#e30613" stroke-width="1.63"/>
    <path id="Path_241" data-name="Path 241" d="M3.113,0S-1.2,1.714.327,7.316,7.6,12.6,7.6,12.6" transform="translate(888.755 951.6) rotate(60)" fill="none" stroke="#e30613" stroke-width="1.63"/>
    <path id="Path_242" data-name="Path 242" d="M3.443,0A6.609,6.609,0,0,0,.307,7.883a6.371,6.371,0,0,0,6.819,4.955" transform="translate(874.228 940.758) rotate(60)" fill="none" stroke="#e30613" stroke-width="1.63"/>
    <g id="Ellipse_20" data-name="Ellipse 20" transform="translate(926.353 987.773)" fill="#fff" stroke="#e30613" stroke-width="1.63">
      <circle cx="4.817" cy="4.817" r="4.817" stroke="none"/>
      <circle cx="4.817" cy="4.817" r="4.002" fill="none"/>
    </g>
  </g>
</svg>
