<svg xmlns="http://www.w3.org/2000/svg" width="36.946" height="36.946" viewBox="0 0 36.946 36.946">
  <g id="exchange" transform="translate(0 -0.501)">
    <path id="Path_180" data-name="Path 180" d="M36.572,8.491,22.183.59a.722.722,0,0,0-.695,0L16.065,3.568a.724.724,0,0,0-.31.17L7.1,8.491a.721.721,0,0,0-.374.633V18.68A9.613,9.613,0,0,0,.975,32.06a.722.722,0,0,0,1.3-.634,8.158,8.158,0,1,1,3.75,3.75.722.722,0,0,0-.633,1.3,9.62,9.62,0,0,0,12.991-4.721l3.109,1.707a.721.721,0,0,0,.695,0l14.389-7.9a.722.722,0,0,0,.374-.633V19.911a.722.722,0,1,0-1.443,0V24.5L22.56,31.606V17.451L26.831,15.1v3.719a.722.722,0,0,0,1.069.632l3.083-1.7a.721.721,0,0,0,.373-.632V12.619L35.5,10.343v3.8a.722.722,0,1,0,1.443,0V9.124A.721.721,0,0,0,36.572,8.491ZM21.836,2.046l12.89,7.078L30.66,11.357,17.77,4.278Zm0,14.156L8.946,9.124l4.215-2.315,12.89,7.078Zm5.714-3.138L14.66,5.986,16.27,5.1l12.89,7.078ZM16.393,21.055A9.539,9.539,0,0,0,9.6,18.242a9.733,9.733,0,0,0-1.435.106V10.343l12.948,7.11V31.609l-2.247-1.234a9.648,9.648,0,0,0,.336-2.531A9.538,9.538,0,0,0,16.393,21.055ZM29.915,16.7l-1.64.9v-3.29l1.64-.9Zm0,0" fill="#e30916"/>
    <path id="Path_181" data-name="Path 181" d="M492.722,219.441a.722.722,0,1,0,.51.211A.727.727,0,0,0,492.722,219.441Zm0,0" transform="translate(-456.497 -203.142)" fill="#e30916"/>
    <path id="Path_182" data-name="Path 182" d="M67.913,326.328a.721.721,0,0,0,.51-1.232l-.5-.5h4.265a1.876,1.876,0,1,1,0,3.752H69.661a.721.721,0,1,0,0,1.443h2.527a3.319,3.319,0,1,0,0-6.638H67.924l.5-.5a.722.722,0,1,0-1.02-1.021l-1.732,1.732a.722.722,0,0,0,0,1.021l1.732,1.732A.719.719,0,0,0,67.913,326.328Zm0,0" transform="translate(-60.736 -297.762)" fill="#e30916"/>
    <path id="Path_183" data-name="Path 183" d="M36.79,457.876a.718.718,0,0,1-.551-.257v0a.721.721,0,1,1,.553.258Zm0,0" transform="translate(-33.465 -423.031)" fill="#e30916"/>
  </g>
</svg>
