<svg xmlns="http://www.w3.org/2000/svg" width="30.127" height="31.168" viewBox="0 0 30.127 31.168">
  <g id="daoBusiness" transform="translate(-8.551 0)">
    <g id="Group_68" data-name="Group 68" transform="translate(8.551 0)">
      <g id="Group_67" data-name="Group 67" transform="translate(0 0)">
        <path id="Path_135" data-name="Path 135" d="M38.464,9.974,23.888.084a.488.488,0,0,0-.548,0L8.765,9.974a.488.488,0,0,0-.214.4v20.3a.488.488,0,0,0,.488.488H38.19a.488.488,0,0,0,.488-.488v-20.3A.488.488,0,0,0,38.464,9.974ZM20,30.191H14.732V24.921h1.106v2.635a.488.488,0,0,0,.488.488h2.082a.488.488,0,0,0,.488-.488V24.921H20v5.271Zm-6.312-17.7V11.387H33.537v1.106Zm3.123,14.575V24.921h1.106v2.147ZM20,23.945H14.732V18.674h1.106V21.31a.488.488,0,0,0,.488.488h2.082a.488.488,0,0,0,.488-.488V18.674H20Zm-3.188-3.123V18.674h1.106v2.147Zm9.435,9.37H20.979V24.921h1.106v2.635a.488.488,0,0,0,.488.488h2.082a.488.488,0,0,0,.488-.488V24.921H26.25v5.271Zm-3.188-3.123V24.921h1.106v2.147ZM37.7,30.191H33.472V19.748a.488.488,0,1,0-.976,0V30.191H27.226V24.433a.488.488,0,0,0-.488-.488H20.979V18.186a.488.488,0,0,0-.488-.488H14.732V13.469H32.5v4.2a.488.488,0,0,0,.976,0v-4.2h.553a.488.488,0,0,0,.488-.488V10.9a.488.488,0,0,0-.488-.488H13.2a.488.488,0,0,0-.488.488v2.082a.488.488,0,0,0,.488.488h.553V30.191H9.527V10.637L23.614,1.077,37.7,10.637V30.191Z" transform="translate(-8.551 0)" fill="#e30613"/>
      </g>
    </g>
    <g id="Group_70" data-name="Group 70" transform="translate(21.044 4.164)">
      <g id="Group_69" data-name="Group 69">
        <path id="Path_136" data-name="Path 136" d="M218.431,68.409h-4.164a.488.488,0,1,0,0,.976h4.164a.488.488,0,1,0,0-.976Z" transform="translate(-213.779 -68.409)" fill="#e30613"/>
      </g>
    </g>
    <g id="Group_72" data-name="Group 72" transform="translate(21.044 6.246)">
      <g id="Group_71" data-name="Group 71">
        <path id="Path_137" data-name="Path 137" d="M218.431,102.614h-4.164a.488.488,0,1,0,0,.976h4.164a.488.488,0,1,0,0-.976Z" transform="translate(-213.779 -102.614)" fill="#e30613"/>
      </g>
    </g>
    <g id="Group_74" data-name="Group 74" transform="translate(21.044 8.328)">
      <g id="Group_73" data-name="Group 73">
        <path id="Path_138" data-name="Path 138" d="M218.431,136.818h-4.164a.488.488,0,1,0,0,.976h4.164a.488.488,0,1,0,0-.976Z" transform="translate(-213.779 -136.818)" fill="#e30613"/>
      </g>
    </g>
    <g id="Group_76" data-name="Group 76" transform="translate(15.839 22.383)">
      <g id="Group_75" data-name="Group 75" transform="translate(0)">
        <path id="Path_139" data-name="Path 139" d="M130.837,367.7h-2.082a.488.488,0,1,0,0,.976h2.082a.488.488,0,1,0,0-.976Z" transform="translate(-128.267 -367.7)" fill="#e30613"/>
      </g>
    </g>
    <g id="Group_78" data-name="Group 78" transform="translate(15.839 28.63)">
      <g id="Group_77" data-name="Group 77" transform="translate(0)">
        <path id="Path_140" data-name="Path 140" d="M130.837,470.313h-2.082a.488.488,0,1,0,0,.976h2.082a.488.488,0,1,0,0-.976Z" transform="translate(-128.267 -470.313)" fill="#e30613"/>
      </g>
    </g>
    <g id="Group_80" data-name="Group 80" transform="translate(22.085 28.63)">
      <g id="Group_79" data-name="Group 79">
        <path id="Path_141" data-name="Path 141" d="M233.45,470.313h-2.082a.488.488,0,1,0,0,.976h2.082a.488.488,0,1,0,0-.976Z" transform="translate(-230.88 -470.313)" fill="#e30613"/>
      </g>
    </g>
  </g>
</svg>
