\begin{thebibliography}{}

\bibitem [\protect \citeauthoryear {%
\APACcitebtitle {(2) DDA Line Drawing Algorithm - Computer Graphics -
  YouTube}}{%
\APACcitebtitle {(2) DDA Line Drawing Algorithm - Computer Graphics -
  YouTube}}{%
{\protect \APACyear {{\protect \bibnodate {}}}}%
}]{%
DDAVideo:online}
\APACinsertmetastar {%
DDAVideo:online}%
\APACrefbtitle {(2) DDA Line Drawing Algorithm - Computer Graphics - YouTube.}
  {(2) dda line drawing algorithm - computer graphics - youtube.}
\newblock
\APACrefYearMonthDay{{\protect \bibnodate {}}}{}{}.
\newblock
\APAChowpublished
  {\url{https://www.youtube.com/watch?v=W5P8GlaEOSI&ab_channel=AbdulBari}}.
\newblock
\APACrefnote{(Accessed on 06/02/2022)}
\PrintBackRefs{\CurrentBib}

\bibitem [\protect \citeauthoryear {%
\APACcitebtitle {(2) Particle Filter and Monte Carlo Localization (Cyrill
  Stachniss) - YouTube}}{%
\APACcitebtitle {(2) Particle Filter and Monte Carlo Localization (Cyrill
  Stachniss) - YouTube}}{%
{\protect \APACyear {{\protect \bibnodate {}}}}%
}]{%
MCLYoutbe:online}
\APACinsertmetastar {%
MCLYoutbe:online}%
\APACrefbtitle {(2) Particle Filter and Monte Carlo Localization (Cyrill
  Stachniss) - YouTube.} {(2) particle filter and monte carlo localization
  (cyrill stachniss) - youtube.}
\newblock
\APACrefYearMonthDay{{\protect \bibnodate {}}}{}{}.
\newblock
\APAChowpublished
  {\url{https://www.youtube.com/watch?v=MsYlueVDLI0&t=2572s&ab_channel=CyrillStachniss}}.
\newblock
\APACrefnote{(Accessed on 06/02/2022)}
\PrintBackRefs{\CurrentBib}

\bibitem [\protect \citeauthoryear {%
\APACcitebtitle {cv\_bridge - ROS Wiki}}{%
\APACcitebtitle {cv\_bridge - ROS Wiki}}{%
{\protect \APACyear {{\protect \bibnodate {}}}}%
}]{%
CvBridge:online}
\APACinsertmetastar {%
CvBridge:online}%
\APACrefbtitle {cv\_bridge - ROS Wiki.} {cv\_bridge - ros wiki.}
\newblock
\APACrefYearMonthDay{{\protect \bibnodate {}}}{}{}.
\newblock
\APAChowpublished {\url{http://wiki.ros.org/cv_bridge}}.
\newblock
\APACrefnote{(Accessed on 06/01/2022)}
\PrintBackRefs{\CurrentBib}

\bibitem [\protect \citeauthoryear {%
\APACcitebtitle {DDA Line generation Algorithm in Computer Graphics -
  GeeksforGeeks}}{%
\APACcitebtitle {DDA Line generation Algorithm in Computer Graphics -
  GeeksforGeeks}}{%
{\protect \APACyear {{\protect \bibnodate {}}}}%
}]{%
DDAWritten:online}
\APACinsertmetastar {%
DDAWritten:online}%
\APACrefbtitle {DDA Line generation Algorithm in Computer Graphics -
  GeeksforGeeks.} {Dda line generation algorithm in computer graphics -
  geeksforgeeks.}
\newblock
\APACrefYearMonthDay{{\protect \bibnodate {}}}{}{}.
\newblock
\APAChowpublished
  {\url{https://www.geeksforgeeks.org/dda-line-generation-algorithm-computer-graphics/}}.
\newblock
\APACrefnote{(Accessed on 06/02/2022)}
\PrintBackRefs{\CurrentBib}

\bibitem [\protect \citeauthoryear {%
\APACcitebtitle {jeguzzi/robomaster\_ros}}{%
\APACcitebtitle {jeguzzi/robomaster\_ros}}{%
{\protect \APACyear {{\protect \bibnodate {}}}}%
}]{%
RobomasterRosRepo:online}
\APACinsertmetastar {%
RobomasterRosRepo:online}%
\APACrefbtitle {jeguzzi/robomaster\_ros.} {jeguzzi/robomaster\_ros.}
\newblock
\APACrefYearMonthDay{{\protect \bibnodate {}}}{}{}.
\newblock
\APAChowpublished {\url{https://github.com/jeguzzi/robomaster_ros}}.
\newblock
\APACrefnote{(Accessed on 06/01/2022)}
\PrintBackRefs{\CurrentBib}

\bibitem [\protect \citeauthoryear {%
\APACcitebtitle {Monte Carlo localization - Wikipedia}}{%
\APACcitebtitle {Monte Carlo localization - Wikipedia}}{%
{\protect \APACyear {{\protect \bibnodate {}}}}%
}]{%
MCLWiki:online}
\APACinsertmetastar {%
MCLWiki:online}%
\APACrefbtitle {Monte Carlo localization - Wikipedia.} {Monte carlo
  localization - wikipedia.}
\newblock
\APACrefYearMonthDay{{\protect \bibnodate {}}}{}{}.
\newblock
\APAChowpublished
  {\url{https://en.wikipedia.org/wiki/Monte_Carlo_localization}}.
\newblock
\APACrefnote{(Accessed on 06/02/2022)}
\PrintBackRefs{\CurrentBib}

\bibitem [\protect \citeauthoryear {%
\APACcitebtitle {RoboMaster EP - DJI}}{%
\APACcitebtitle {RoboMaster EP - DJI}}{%
{\protect \APACyear {{\protect \bibnodate {}}}}%
}]{%
RoboMaster:online}
\APACinsertmetastar {%
RoboMaster:online}%
\APACrefbtitle {RoboMaster EP - DJI.} {Robomaster ep - dji.}
\newblock
\APACrefYearMonthDay{{\protect \bibnodate {}}}{}{}.
\newblock
\APAChowpublished {\url{https://www.dji.com/ch/robomaster-ep}}.
\newblock
\APACrefnote{(Accessed on 06/01/2022)}
\PrintBackRefs{\CurrentBib}

\bibitem [\protect \citeauthoryear {%
\APACcitebtitle {Robot simulator CoppeliaSim: create, compose, simulate, any
  robot - Coppelia Robotics}}{%
\APACcitebtitle {Robot simulator CoppeliaSim: create, compose, simulate, any
  robot - Coppelia Robotics}}{%
{\protect \APACyear {{\protect \bibnodate {}}}}%
}]{%
CoppeliaSim:online}
\APACinsertmetastar {%
CoppeliaSim:online}%
\APACrefbtitle {Robot simulator CoppeliaSim: create, compose, simulate, any
  robot - Coppelia Robotics.} {Robot simulator coppeliasim: create, compose,
  simulate, any robot - coppelia robotics.}
\newblock
\APACrefYearMonthDay{{\protect \bibnodate {}}}{}{}.
\newblock
\APAChowpublished {\url{https://www.coppeliarobotics.com/}}.
\newblock
\APACrefnote{(Accessed on 06/01/2022)}
\PrintBackRefs{\CurrentBib}

\bibitem [\protect \citeauthoryear {%
\APACcitebtitle {sklearn.cluster.DBSCAN — scikit-learn 1.1.1
  documentation}}{%
\APACcitebtitle {sklearn.cluster.DBSCAN — scikit-learn 1.1.1
  documentation}}{%
{\protect \APACyear {{\protect \bibnodate {}}}}%
}]{%
DBScan:online}
\APACinsertmetastar {%
DBScan:online}%
\APACrefbtitle {sklearn.cluster.DBSCAN — scikit-learn 1.1.1 documentation.}
  {sklearn.cluster.dbscan — scikit-learn 1.1.1 documentation.}
\newblock
\APACrefYearMonthDay{{\protect \bibnodate {}}}{}{}.
\newblock
\APAChowpublished
  {\url{https://scikit-learn.org/stable/modules/generated/sklearn.cluster.DBSCAN.html}}.
\newblock
\APACrefnote{(Accessed on 06/02/2022)}
\PrintBackRefs{\CurrentBib}

\end{thebibliography}
