^D:\USER DATA\PROJECTS\CONSOLE GAME ENGINE\SIENGINE\SIENGINE\X64\DEBUG\APPLICATION.OBJ|D:\USER DATA\PROJECTS\CONSOLE GAME ENGINE\SIENGINE\SIENGINE\X64\DEBUG\LOG.OBJ
D:\USER DATA\PROJECTS\CONSOLE GAME ENGINE\SIENGINE\X64\DEBUG\SIENGINE.ILK
D:\USER DATA\PROJECTS\CONSOLE GAME ENGINE\SIENGINE\X64\DEBUG\SIENGINE.DLL
D:\USER DATA\PROJECTS\CONSOLE GAME ENGINE\SIENGINE\X64\DEBUG\SIENGINE.PDB
