%YAML 1.1
%TAG !u! tag:unity3d.com,2011:
--- !u!1045 &1
EditorBuildSettings:
  m_ObjectHideFlags: 0
  serializedVersion: 2
  m_Scenes:
  - enabled: 1
    path: Assets/Scenes/SampleScene.unity
    guid: 9fc0d4010bbf28b4594072e72b8655ab
  - enabled: 0
    path: Assets/Scenes/ExamplePrototypes.unity
    guid: 8db3f77b86e19cb4a92eff33ac7c6bb0
  - enabled: 0
    path: Assets/Scenes/TrainingSampleScene.unity
    guid: 2a4297c2f1ba6c14e93876b522c13bc2
  m_configObjects:
    com.unity.xr.management.loader_settings: {fileID: 11400000, guid: df8efcbe4b744e44f800124dd68b4080, type: 2}
    com.unity.xr.openxr.settings4: {fileID: 11400000, guid: c5b596decca04da44891b97828540621, type: 2}
