%YAML 1.1
%TAG !u! tag:unity3d.com,2011:
--- !u!1 &8343724594276134004
GameObject:
  m_ObjectHideFlags: 0
  m_CorrespondingSourceObject: {fileID: 0}
  m_PrefabInstance: {fileID: 0}
  m_PrefabAsset: {fileID: 0}
  serializedVersion: 6
  m_Component:
  - component: {fileID: 2943475134008555117}
  m_Layer: 0
  m_Name: Schneidebrett
  m_TagString: Untagged
  m_Icon: {fileID: 0}
  m_NavMeshLayer: 0
  m_StaticEditorFlags: 0
  m_IsActive: 1
--- !u!4 &2943475134008555117
Transform:
  m_ObjectHideFlags: 0
  m_CorrespondingSourceObject: {fileID: 0}
  m_PrefabInstance: {fileID: 0}
  m_PrefabAsset: {fileID: 0}
  m_GameObject: {fileID: 8343724594276134004}
  m_LocalRotation: {x: 0, y: 0, z: 0, w: 1}
  m_LocalPosition: {x: 0, y: 0, z: 0}
  m_LocalScale: {x: 0.05, y: 0.05, z: 0.05}
  m_Children:
  - {fileID: 5404989539944841542}
  m_Father: {fileID: 0}
  m_RootOrder: 0
  m_LocalEulerAnglesHint: {x: 0, y: 0, z: 0}
--- !u!1001 &4245341788215664892
PrefabInstance:
  m_ObjectHideFlags: 0
  serializedVersion: 2
  m_Modification:
    m_TransformParent: {fileID: 2943475134008555117}
    m_Modifications:
    - target: {fileID: 8837129167131278080, guid: ac777732654be9a488efb3a83e48f322,
        type: 3}
      propertyPath: m_Name
      value: Schneidebrett_V1
      objectReference: {fileID: 0}
    - target: {fileID: 8207839477598134714, guid: ac777732654be9a488efb3a83e48f322,
        type: 3}
      propertyPath: m_LocalPosition.x
      value: 0
      objectReference: {fileID: 0}
    - target: {fileID: 8207839477598134714, guid: ac777732654be9a488efb3a83e48f322,
        type: 3}
      propertyPath: m_LocalPosition.y
      value: 0
      objectReference: {fileID: 0}
    - target: {fileID: 8207839477598134714, guid: ac777732654be9a488efb3a83e48f322,
        type: 3}
      propertyPath: m_LocalPosition.z
      value: 0
      objectReference: {fileID: 0}
    - target: {fileID: 8207839477598134714, guid: ac777732654be9a488efb3a83e48f322,
        type: 3}
      propertyPath: m_LocalRotation.x
      value: -0.7071068
      objectReference: {fileID: 0}
    - target: {fileID: 8207839477598134714, guid: ac777732654be9a488efb3a83e48f322,
        type: 3}
      propertyPath: m_LocalRotation.y
      value: 0
      objectReference: {fileID: 0}
    - target: {fileID: 8207839477598134714, guid: ac777732654be9a488efb3a83e48f322,
        type: 3}
      propertyPath: m_LocalRotation.z
      value: 0
      objectReference: {fileID: 0}
    - target: {fileID: 8207839477598134714, guid: ac777732654be9a488efb3a83e48f322,
        type: 3}
      propertyPath: m_LocalRotation.w
      value: 0.7071068
      objectReference: {fileID: 0}
    - target: {fileID: 8207839477598134714, guid: ac777732654be9a488efb3a83e48f322,
        type: 3}
      propertyPath: m_RootOrder
      value: 0
      objectReference: {fileID: 0}
    - target: {fileID: 8207839477598134714, guid: ac777732654be9a488efb3a83e48f322,
        type: 3}
      propertyPath: m_LocalEulerAnglesHint.x
      value: -90
      objectReference: {fileID: 0}
    - target: {fileID: 8207839477598134714, guid: ac777732654be9a488efb3a83e48f322,
        type: 3}
      propertyPath: m_LocalEulerAnglesHint.y
      value: 0
      objectReference: {fileID: 0}
    - target: {fileID: 8207839477598134714, guid: ac777732654be9a488efb3a83e48f322,
        type: 3}
      propertyPath: m_LocalEulerAnglesHint.z
      value: 0
      objectReference: {fileID: 0}
    - target: {fileID: 8207839477598134714, guid: ac777732654be9a488efb3a83e48f322,
        type: 3}
      propertyPath: m_LocalScale.x
      value: 400
      objectReference: {fileID: 0}
    - target: {fileID: 8207839477598134714, guid: ac777732654be9a488efb3a83e48f322,
        type: 3}
      propertyPath: m_LocalScale.y
      value: 250
      objectReference: {fileID: 0}
    - target: {fileID: 8207839477598134714, guid: ac777732654be9a488efb3a83e48f322,
        type: 3}
      propertyPath: m_LocalScale.z
      value: 5
      objectReference: {fileID: 0}
    m_RemovedComponents: []
  m_SourcePrefab: {fileID: 100100000, guid: ac777732654be9a488efb3a83e48f322, type: 3}
--- !u!4 &5404989539944841542 stripped
Transform:
  m_CorrespondingSourceObject: {fileID: 8207839477598134714, guid: ac777732654be9a488efb3a83e48f322,
    type: 3}
  m_PrefabInstance: {fileID: 4245341788215664892}
  m_PrefabAsset: {fileID: 0}
