{
  "Elements": [
    {
       "Type": "TouchArea",
       "Name": "Screen",
       "Plane": {
         "x": 0.0,
         "y": 0.0,
         "z": 1.0
       },
       "Resolution": {
         "x": 3482.0,
         "y": 6456.0
       }
     },


     {
       "Type": "Button",
       "Name": "PowerButton"
     },
     {
       "Type": "Button",
       "Name": "CleanerButton"
     },
     {
       "Type": "Button",
       "Name": "LifterButton"
     },


     {
       "Type": "Rotatable",
       "Name": "Rechts",
       "InitialAttributeValues": [
         { "Attribute": "VALUE", "Value": "0.0" }
       ],
       "MinRotation": 0.0,
       "MaxRotation": 20.0,
       "RotationAxis": {
         "Origin": {
           "x": 0.0,
           "y": 0.0,
           "z": 0.0
         },
         "Direction": {
           "x": 0.0,
           "y": 1.0,
           "z": 0.0
         }
       }
     },
     {
       "Type": "Rotatable",
       "Name": "Links",
       "InitialAttributeValues": [
         { "Attribute": "VALUE", "Value": "0.0" }
       ],
       "MinRotation": 0.0,
       "MaxRotation": 20.0,
       "RotationAxis": {
         "Origin": {
           "x": 0.0,
           "y": 0.0,
           "z": 0.0
         },
         "Direction": {
           "x": 0.0,
           "y": -1.0,
           "z": 0.0
         }
       }
     },


     {
       "Type": "Movable",
       "Name": "Toast",
       "SnapPoses": [
         { "Position": "(-0.157,-0.037,-0.205)", "Rotation": "(179.719,90.562,68.58499)" },
         { "Position": "(0.064,-0.037,-0.205)", "Rotation": "(179.719,90.562,68.58499)" }
       ]
     },


     {
       "Type": "Movable",
       "Name": "Toast2",
       "SnapPoses": [
         { "Position": "(-0.157,-0.037,-0.205)", "Rotation": "(181.567,90.101,65.823)" },
         { "Position": "(0.064,-0.037,-0.205)", "Rotation": "(181.567,90.101,65.823)" }
       ]
     },
     {
       "Type": "Movable",
       "Name": "Bagel_01",
       "SnapPoses": [
         { "Position": "(-0.157,-0.037,-0.205)", "Rotation": "(181.567,90.101,65.823)" },
         { "Position": "(0.064,-0.037,-0.205)", "Rotation": "(181.567,90.101,65.823)" }
       ]
     },
     {
       "Type": "Movable",
       "Name": "Bagel_02",
       "SnapPoses": [
         { "Position": "(-0.157,-0.037,-0.205)", "Rotation": "(181.567,90.101,65.823)" },
         { "Position": "(0.064,-0.037,-0.205)", "Rotation": "(181.567,90.101,65.823)" }
       ]
     },
     {
       "Type": "Movable",
       "Name": "Bagel_03",
       "SnapPoses": [
         { "Position": "(-0.157,-0.037,-0.205)", "Rotation": "(181.567,90.101,65.823)" },
         { "Position": "(0.064,-0.037,-0.205)", "Rotation": "(181.567,90.101,65.823)" }
       ]
     }





 ]
}
