{
  "Elements": [
    {
      "Type": "AppearingObject",
      "Name": "MotherboardCable",
      "Value": 0.0
    },{
      "Type": "AppearingObject",
      "Name": "CPUFanCable",
      "Value": 0.0
    },{
      "Type": "AppearingObject",
      "Name": "CPUFanCable.001",
      "Value": 1
    },{
      "Type": "AppearingObject",
      "Name": "CPUFanConnector",
      "Value": 1
    },{
      "Type": "AppearingObject",
      "Name": "CPUCable",
      "Value": 0.0
    },{
      "Type": "AppearingObject",
      "Name": "GPUCable1",
      "Value": 0.0
    },{
      "Type": "AppearingObject",
      "Name": "GPUCable2",
      "Value": 0.0
    },{
      "Type": "AppearingObject",
      "Name": "SataCable1",
      "Value": 0.0
    },{
      "Type": "AppearingObject",
      "Name": "ODDCable",
      "Value": 0.0
    },{
      "Type": "AppearingObject",
      "Name": "FanCable1",
      "Value": 0.0
    },{
      "Type": "AppearingObject",
      "Name": "FanCable",
      "Value": 1
    },{
      "Type": "AppearingObject",
      "Name": "SysFanPort.001",
      "Value": 1
    },{
      "Type": "AppearingObject",
      "Name": "HDDCable",
      "Value": 0.0
    },{
      "Type": "AppearingObject",
      "Name": "SataCable2",
      "Value": 0.0
    },{
      "Type": "AppearingObject",
      "Name": "HDAudioCable",
      "Value": 1.0
    },{
      "Type": "AppearingObject",
      "Name": "HDAudioCable.001",
      "Value": 0.0
    },{
      "Type": "AppearingObject",
      "Name": "HDAUDIOCableConnector",
      "Value": 1.0
    },{
      "Type": "AppearingObject",
      "Name": "USB30Cable",
      "Value": 1.0
    },{
      "Type": "AppearingObject",
      "Name": "USB30Cable.001",
      "Value": 0.0
    },{
      "Type": "AppearingObject",
      "Name": "USB30CableConnector",
      "Value": 1.0
    },{
      "Type": "AppearingObject",
      "Name": "USB20Cable",
      "Value": 1.0
    },{
      "Type": "AppearingObject",
      "Name": "USB20Cable.001",
      "Value": 0.0
    },{
      "Type": "AppearingObject",
      "Name": "USB20CableConnector",
      "Value": 1.0
    },{
      "Type": "AppearingObject",
      "Name": "PowerLED+Cable",
      "Value": 1.0
    },{
      "Type": "AppearingObject",
      "Name": "PowerLED+Cable.001",
      "Value": 0.0
    },{
      "Type": "AppearingObject",
      "Name": "PowerLED+CableConnector",
      "Value": 1.0
    },{
      "Type": "AppearingObject",
      "Name": "PowerLED-Cable",
      "Value": 1.0
    },{
      "Type": "AppearingObject",
      "Name": "PowerLED-Cable.001",
      "Value": 0.0
    },{
      "Type": "AppearingObject",
      "Name": "PowerLED-CableConnector",
      "Value": 1.0
    },{
      "Type": "AppearingObject",
      "Name": "PowerSwitchCablle",
      "Value": 1.0
    },{
      "Type": "AppearingObject",
      "Name": "PowerSwitchCable.001",
      "Value": 0.0
    },{
      "Type": "AppearingObject",
      "Name": "PowerSwitchCablleConnector",
      "Value": 1.0
    },{
      "Type": "AppearingObject",
      "Name": "HDDLEDCable",
      "Value": 1.0
    },{
      "Type": "AppearingObject",
      "Name": "HDDLEDCable.001",
      "Value": 0.0
    },{
      "Type": "AppearingObject",
      "Name": "HDDLEDCableConnector",
      "Value": 1.0
    },{
      "Type": "AppearingObject",
      "Name": "ResetSwitchCable",
      "Value": 1.0
    },{
      "Type": "AppearingObject",
      "Name": "ResetSwitchCable.001",
      "Value": 0.0
    },{
      "Type": "AppearingObject",
      "Name": "ResetSwitchCableConnector",
      "Value": 1.0
    },{
      "Type": "AppearingObject",
      "Name": "ThermalPaste",
      "Value": 1.0
    },{
      "Type": "AppearingObject",
      "Name": "Paste",
      "Value": 0.0
    },{
      "Type": "AppearingObject",
      "Name": "ThermalPasteKnob",
      "Value": 1.0
    },{
      "Type": "AppearingObject",
      "Name": "CPUOutline",
      "Value": 0.0
    },

    {
      "Type": "AppearingObject",
      "Name": "HDAudioOutline",
      "Value": 0.0
    },{
      "Type": "AppearingObject",
      "Name": "USB30Outline",
      "Value": 0.0
    },{
      "Type": "AppearingObject",
      "Name": "USB20Outline",
      "Value": 0.0
    },{
      "Type": "AppearingObject",
      "Name": "PWRLED+Outline",
      "Value": 0.0
    },{
      "Type": "AppearingObject",
      "Name": "PWRLED-Outline",
      "Value": 0.0
    },{
      "Type": "AppearingObject",
      "Name": "PWRSWOutline",
      "Value": 0.0
    },{
      "Type": "AppearingObject",
      "Name": "HDDLEDOutline",
      "Value": 0.0
    },{
      "Type": "AppearingObject",
      "Name": "RESETSWOutline",
      "Value": 0.0
    },{
      "Type": "AppearingObject",
      "Name": "RAM (1)Outline",
      "Value": 0.0
    },{
      "Type": "AppearingObject",
      "Name": "RAMOutline",
      "Value": 0.0
    },{
      "Type": "AppearingObject",
      "Name": "CPUPortOutline",
      "Value": 0.0
    },{
      "Type": "AppearingObject",
      "Name": "24VOutline",
      "Value": 0.0
    },{
      "Type": "AppearingObject",
      "Name": "CPUFANPortOutline",
      "Value": 0.0
    },{
      "Type": "AppearingObject",
      "Name": "CPUFanConnectorOutline",
      "Value": 0.0
    },{
      "Type": "AppearingObject",
      "Name": "SYSFANPortOutline",
      "Value": 0.0
    },{
      "Type": "AppearingObject",
      "Name": "ThermalPasteOutline",
      "Value": 0.0
    },{
      "Type": "AppearingObject",
      "Name": "M2SSDCoverOutline",
      "Value": 0.0
    },{
      "Type": "AppearingObject",
      "Name": "M2SSDOutline",
      "Value": 0.0
    },{
      "Type": "AppearingObject",
      "Name": "CPUFanOutlines",
      "Value": 0.0
    },{
      "Type": "AppearingObject",
      "Name": "HDDOutline",
      "Value": 0.0
    },{
      "Type": "AppearingObject",
      "Name": "CD_Cover_1Outline",
      "Value": 0.0
    },{
      "Type": "AppearingObject",
      "Name": "CaseFanOutline",
      "Value": 0.0
    },{
      "Type": "AppearingObject",
      "Name": "ODDOutline",
      "Value": 0.0
    },{
      "Type": "AppearingObject",
      "Name": "PSUOutline",
      "Value": 0.0
    },{
      "Type": "AppearingObject",
      "Name": "MotherboardOutline",
      "Value": 0.0
    },{
      "Type": "AppearingObject",
      "Name": "Card_Slot_2.001Outline",
      "Value": 0.0
    },{
      "Type": "AppearingObject",
      "Name": "Card_Slot_3.001Outline",
      "Value": 0.0
    },{
      "Type": "AppearingObject",
      "Name": "GPUOutline",
      "Value": 0.0
    },{
      "Type": "AppearingObject",
      "Name": "CPUSlotOutline",
      "Value": 0.0
    },{
      "Type": "AppearingObject",
      "Name": "HDDSlotOutline",
      "Value": 0.0
    },{
      "Type": "AppearingObject",
      "Name": "MotherboardSlotOutline",
      "Value": 0.0
    },{
      "Type": "AppearingObject",
      "Name": "ODDSlotOutline",
      "Value": 0.0
    },{
      "Type": "AppearingObject",
      "Name": "PCIe-1Outline",
      "Value": 0.0
    },{
      "Type": "AppearingObject",
      "Name": "PCIe-2Outline",
      "Value": 0.0
    },{
      "Type": "AppearingObject",
      "Name": "GPUPCIe-1Outline",
      "Value": 0.0
    },{
      "Type": "AppearingObject",
      "Name": "GPUPCIe-2Outline",
      "Value": 0.0
    },{
      "Type": "AppearingObject",
      "Name": "12vPortODDOutline",
      "Value": 0.0
    },{
      "Type": "AppearingObject",
      "Name": "SATASlotODDOutline",
      "Value": 0.0
    },{
      "Type": "AppearingObject",
      "Name": "SATAPortHDDOutline",
      "Value": 0.0
    },{
      "Type": "AppearingObject",
      "Name": "12vPortHDDOutline",
      "Value": 0.0
    },{
      "Type": "AppearingObject",
      "Name": "Sata1Outline",
      "Value": 0.0
    },{
      "Type": "AppearingObject",
      "Name": "Sata2Outline",
      "Value": 0.0
    },{
      "Type": "AppearingObject",
      "Name": "12vPortODDOutline",
      "Value": 0.0
    },{
      "Type": "AppearingObject",
      "Name": "SATASlotODDOutline",
      "Value": 0.0
    },{
      "Type": "AppearingObject",
      "Name": "ThermalPasteKnobOutline",
      "Value": 0.0
    },{
      "Type": "AppearingObject",
      "Name": "SysFanPort.001Outline",
      "Value": 0.0
    },
    {
      "Type": "AppearingObject",
      "Name": "USB30CableConnectorOutline",
      "Value": 0.0
    },
    {
      "Type": "AppearingObject",
      "Name": "HDAUDIOCableConnectorOutline",
      "Value": 0.0
    },
    {
      "Type": "AppearingObject",
      "Name": "HDDLEDCableConnectorOutline",
      "Value": 0.0
    },
    {
      "Type": "AppearingObject",
      "Name": "PowerLED+CableConnectorOutline",
      "Value": 0.0
    },
    {
      "Type": "AppearingObject",
      "Name": "PowerLED-CableConnectorOutline",
      "Value": 0.0
    },
    {
      "Type": "AppearingObject",
      "Name": "PowerSwitchCableConnectorOutline",
      "Value": 0.0
    },
    {
      "Type": "AppearingObject",
      "Name": "ResetSwitchCableConnectorOutline",
      "Value": 0.0
    },
    {
      "Type": "AppearingObject",
      "Name": "USB20CableConnectorOutline",
      "Value": 0.0
    },
    {
      "Type": "AppearingObject",
      "Name": "HDDS",
      "Value": 1.0
    },
    {
      "Type": "AppearingObject",
      "Name": "HDDE",
      "Value": 1.0
    },
    {
      "Type": "AppearingObject",
      "Name": "HDDSOutline",
      "Value": 0.0
    },
    {
      "Type": "AppearingObject",
      "Name": "HDDEOutline",
      "Value": 0.0
    },
    {
      "Type": "AppearingObject",
      "Name": "ODDS",
      "Value": 1.0
    },
    {
      "Type": "AppearingObject",
      "Name": "ODDE",
      "Value": 1.0
    },
    {
      "Type": "AppearingObject",
      "Name": "ODDSOutline",
      "Value": 0.0
    },
    {
      "Type": "AppearingObject",
      "Name": "ODDEOutline",
      "Value": 0.0
    },
    {
      "Type": "AppearingObject",
      "Name": "CPUS",
      "Value": 1.0
    },
    {
      "Type": "AppearingObject",
      "Name": "CPUE",
      "Value": 1.0
    },
    {
      "Type": "AppearingObject",
      "Name": "CPUSOutline",
      "Value": 0.0
    },
    {
      "Type": "AppearingObject",
      "Name": "CPUEOutline",
      "Value": 0.0
    },
    {
      "Type": "AppearingObject",
      "Name": "MotherboardS",
      "Value": 1.0
    },
    {
      "Type": "AppearingObject",
      "Name": "MotherboardE",
      "Value": 1.0
    },
    {
      "Type": "AppearingObject",
      "Name": "MotherboardSOutline",
      "Value": 0.0
    },
    {
      "Type": "AppearingObject",
      "Name": "MotherboardEOutline",
      "Value": 0.0
    },
    {
      "Type": "AppearingObject",
      "Name": "SATA1S",
      "Value": 1.0
    },
    {
      "Type": "AppearingObject",
      "Name": "SATA1E",
      "Value": 1.0
    },
    {
      "Type": "AppearingObject",
      "Name": "SATA1SOutline",
      "Value": 0.0
    },
    {
      "Type": "AppearingObject",
      "Name": "SATA1EOutline",
      "Value": 0.0
    },
    {
      "Type": "AppearingObject",
      "Name": "SATA2S",
      "Value": 1.0
    },
    {
      "Type": "AppearingObject",
      "Name": "SATA2E",
      "Value": 1.0
    },
    {
      "Type": "AppearingObject",
      "Name": "SATA2SOutline",
      "Value": 0.0
    },
    {
      "Type": "AppearingObject",
      "Name": "SATA2EOutline",
      "Value": 0.0
    },
    {
      "Type": "AppearingObject",
      "Name": "GPU1S",
      "Value": 1.0
    },
    {
      "Type": "AppearingObject",
      "Name": "GPU1E",
      "Value": 1.0
    },
    {
      "Type": "AppearingObject",
      "Name": "GPU1SOutline",
      "Value": 0.0
    },
    {
      "Type": "AppearingObject",
      "Name": "GPU1EOutline",
      "Value": 0.0
    },


    {
      "Type": "AppearingObject",
      "Name": "GPU2S",
      "Value": 1.0
    },
    {
      "Type": "AppearingObject",
      "Name": "GPU2E",
      "Value": 1.0
    },
    {
      "Type": "AppearingObject",
      "Name": "GPU2SOutline",
      "Value": 0.0
    },
    {
      "Type": "AppearingObject",
      "Name": "GPU2EOutline",
      "Value": 0.0
    },
    {
      "Type": "Screen",
      "Name": "InstructionScreen",
      "Plane": {
        "x": 0.0,
        "y": 0.0,
        "z": 1.0
      },
      "Resolution": {
        "x": 800.0,
        "y": 200.0
      }
    }
  ]
}