{
  "States": [
    {
      "Name": "lock.state",
      "Conditions": [

        {
          "Type": "ScreenContentVisualization",
          "VisualizationElement": "screen_ofen_rezepte",
          "FileName": "herdoben_standby.JPG"
        },

        {
          "Type": "ScreenContentVisualization",
          "VisualizationElement": "screen_ofen_status",
          "FileName": "herdoben_standby.JPG"
        }
      ]
    },

    {
      "Name": "unlock.state",
      "Conditions": [

        {
          "Type": "ScreenContentVisualization",
          "VisualizationElement": "screen_ofen_rezepte",
          "FileName": "herdoben_standby_offen.JPG"
        },

        {
          "Type": "ScreenContentVisualization",
          "VisualizationElement": "screen_ofen_status",
          "FileName": "herdoben_standby.JPG"
        }
      ]
    },


    {
      "Name": "on.state",
      "Conditions": [

        {
          "Type": "ScreenContentVisualization",
          "VisualizationElement": "screen_ofen_rezepte",
          "FileName": "herdoben_an.JPG"
        },

        {
          "Type": "ScreenContentVisualization",
          "VisualizationElement": "screen_ofen_status",
          "FileName": "ofen_licht.JPG"
        }
      ]
    },

    {
      "Name": "f5_umluft_1.state",
      "Conditions": [

        {
          "Type": "ScreenContentVisualization",
          "VisualizationElement": "screen_ofen_rezepte",
          "FileName": "herdoben_an.JPG"
        },

        {
          "Type": "ScreenContentVisualization",
          "VisualizationElement": "screen_ofen_status",
          "FileName": "ofen_umluft_1.JPG"
        }
      ]
    },

    {
      "Name": "f5_umluft_2.state",
      "Conditions": [

        {
          "Type": "ScreenContentVisualization",
          "VisualizationElement": "screen_ofen_rezepte",
          "FileName": "herdoben_an.JPG"
        },

        {
          "Type": "ScreenContentVisualization",
          "VisualizationElement": "screen_ofen_status",
          "FileName": "ofen_umluft_2.JPG"
        }
      ]
    },

    {
      "Name": "f5_umluft_3.state",
      "Conditions": [

        {
          "Type": "ScreenContentVisualization",
          "VisualizationElement": "screen_ofen_rezepte",
          "FileName": "herdoben_an.JPG"
        },

        {
          "Type": "ScreenContentVisualization",
          "VisualizationElement": "screen_ofen_status",
          "FileName": "ofen_umluft_3.JPG"
        }
      ]
    },


    {
      "Name": "f1.state",
      "Conditions": [

        {
          "Type": "ScreenContentVisualization",
          "VisualizationElement": "screen_ofen_rezepte",
          "FileName": "herdoben_an.JPG"
        },

        {
          "Type": "ScreenContentVisualization",
          "VisualizationElement": "screen_ofen_status",
          "FileName": "ofen_licht.JPG"
        }
      ]
    },

    {
      "Name": "f2.state",
      "Conditions": [

        {
          "Type": "ScreenContentVisualization",
          "VisualizationElement": "screen_ofen_rezepte",
          "FileName": "herdoben_an.JPG"
        },

        {
          "Type": "ScreenContentVisualization",
          "VisualizationElement": "screen_ofen_status",
          "FileName": "ofen_oberunter.JPG"
        }
      ]
    },

    {
      "Name": "f3.state",
      "Conditions": [

        {
          "Type": "ScreenContentVisualization",
          "VisualizationElement": "screen_ofen_rezepte",
          "FileName": "herdoben_an.JPG"
        },

        {
          "Type": "ScreenContentVisualization",
          "VisualizationElement": "screen_ofen_status",
          "FileName": "ofen_oberhitze.JPG"
        }
      ]
    },

    {
      "Name": "f4.state",
      "Conditions": [

        {
          "Type": "ScreenContentVisualization",
          "VisualizationElement": "screen_ofen_rezepte",
          "FileName": "herdoben_an.JPG"
        },

        {
          "Type": "ScreenContentVisualization",
          "VisualizationElement": "screen_ofen_status",
          "FileName": "ofen_unterhitze.JPG"
        }
      ]
    },

    {
      "Name": "f5.state",
      "Conditions": [

        {
          "Type": "ScreenContentVisualization",
          "VisualizationElement": "screen_ofen_rezepte",
          "FileName": "herdoben_an.JPG"
        },

        {
          "Type": "ScreenContentVisualization",
          "VisualizationElement": "screen_ofen_status",
          "FileName": "ofen_umluft_0.JPG"
        }
      ]
    },

    {
      "Name": "f6.state",
      "Conditions": [

        {
          "Type": "ScreenContentVisualization",
          "VisualizationElement": "screen_ofen_rezepte",
          "FileName": "herdoben_an.JPG"
        },

        {
          "Type": "ScreenContentVisualization",
          "VisualizationElement": "screen_ofen_status",
          "FileName": "ofen_alles.JPG"
        }
      ]
    }

  ]
}