{
    "Elements": [
        {
            "Type": "ToggleButton",
            "Name": "Button1",
            "InitialAttributeValues": [
               { "Attribute": "VALUE", "Value": "false" }
            ]
        },
        {
            "Type": "ToggleButton",
            "Name": "Button2",
            "InitialAttributeValues": [
               { "Attribute": "VALUE", "Value": "true" }
            ]
        },
        {
            "Type": "ToggleButton",
            "Name": "Button3",
            "InitialAttributeValues": [
               { "Attribute": "VALUE", "Value": "true" }
            ]
        },
        {
            "Type": "Button",
            "Name": "Button4"
        },
        {
            "Type": "Slider",
            "Name": "HorizontalSlider",
            "InitialAttributeValues": [
               { "Attribute": "VALUE", "Value": "0.4" }
            ],
            "MinPosition": {
                "x": 0.075,
                "y": 0.0,
                "z": 0.0
            },
            "MaxPosition": {
                "x": -0.075,
                "y": 0.0,
                "z": 0.0
            },
            "PositionResolution": 7
        },
        {
            "Type": "Slider",
            "Name": "VerticalSlider",
            "InitialAttributeValues": [
               { "Attribute": "VALUE", "Value": "0.3" }
            ],
            "MinPosition": {
                "x": 0.0,
                "y": 0.0,
                "z": 0.0
            },
            "MaxPosition": {
                "x": 0.0,
                "y": 0.125,
                "z": 0.0
            },
            "PositionResolution": 3
        },
        {
            "Type": "Slider",
            "Name": "DiagonalSlider",
            "InitialAttributeValues": [
               { "Attribute": "VALUE", "Value": "0.51" }
            ],
            "MinPosition": {
                "x": 0.14,
                "y": 0.05,
                "z": 0.0
            },
            "MaxPosition": {
                "x": 0.0,
                "y": 0.0,
                "z": 0.0
            },
            "PositionResolution": 2
        },
        {
            "Type": "Rotatable",
            "Name": "RotatingKnob1",
            "InitialAttributeValues": [
               { "Attribute": "VALUE", "Value": "0.1" }
            ],
            "MinRotation": -90.0,
            "MaxRotation": 90.0,
            "RotationAxis": {
                "Origin": {
                    "x": 0.01,
                    "y": 0.0,
                    "z": 0.0
                },
                "Direction": {
                    "x": 0.0,
                    "y": 0.0,
                    "z": 1.0
                }
            },
            "PositionResolution": 3
        },
        {
            "Type": "Rotatable",
            "Name": "RotatingKnob2",
            "InitialAttributeValues": [
               { "Attribute": "VALUE", "Value": "0.5" }
            ],
            "MinRotation": -150.0,
            "MaxRotation": 180.0,
            "RotationAxis": {
                "Origin": {
                    "x": 0.0,
                    "y": 0.0,
                    "z": 0.0
                },
                "Direction": {
                    "x": 0.0,
                    "y": 0.0,
                    "z": 1.0
                }
            },
            "PositionResolution": 15
        },
        {
            "Type": "Rotatable",
            "Name": "RotatingKnob3",
            "InitialAttributeValues": [
               { "Attribute": "VALUE", "Value": "1" }
            ],
            "MinRotation": -720.0,
            "MaxRotation": 200.0,
            "RotationAxis": {
                "Origin": {
                    "x": 0.0,
                    "y": 0.0,
                    "z": 0.0
                },
                "Direction": {
                    "x": 0.0,
                    "y": 0.0,
                    "z": 1.0
                }
            },
            "PositionResolution": 35
        },
        {
            "Type": "Rotatable",
            "Name": "RotatingKnob4",
            "InitialAttributeValues": [
               { "Attribute": "VALUE", "Value": "0.6" }
            ],
            "MinRotation": 0.0,
            "MaxRotation": 360.0,
            "RotationAxis": {
                "Origin": {
                    "x": 0.0,
                    "y": 0.0,
                    "z": 0.0
                },
                "Direction": {
                    "x": 0.0,
                    "y": 0.0,
                    "z": 1.0
                }
            },
            "AllowsForInfiniteRotation": true,
            "PositionResolution": 10
        },
        {
            "Type": "TouchArea",
            "Name": "Touchscreen",
            "Plane": {
                "x": 0.0,
                "y": 0.0,
                "z": 1.0
            },
            "Resolution": {
                "x": 960.0,
                "y": 900.0
            }
        },
        {
            "Type": "Movable",
            "Name": "MovingElement1",
            "InitialAttributeValues": [
                { "Attribute": "POSITION", "Value": "(0.2,0.0,0.5)" }
            ],
            "SnapPoses": [
                { "Position": "(0.2,0.2,0.5)" },
                { "Position": "(0.2,-0.2,0.5)", "Rotation": "(20,30,40)" }
            ]
        },
        {
            "Type": "Movable",
            "Name": "MovingElement2",
            "InitialAttributeValues": [
                { "Attribute": "POSITION", "Value": "(-0.2,0.0,0.5)" }
            ],
            "SnapPoses": [
                { "Position": "(-0.2,0.2,0.5)" },
                { "Position": "(-0.2,-0.2,0.5)", "Rotation": "(30,40,50)" }
            ]
        },
        {
            "Type": "Rotatable",
            "Name": "HingeJointCube1",
            "InitialAttributeValues": [
                { "Attribute": "VALUE", "Value": "0.5" }
            ],
            "MinRotation": -90.0,
            "MaxRotation": 0.0,
            "RotationAxis": {
                "Origin": {
                    "x": -0.15,
                    "y": 0.15,
                    "z": 0.0
                },
                "Direction": {
                    "x": 0.0,
                    "y": 0.0,
                    "z": -1.0
                }
            }
        },
        {
            "Type": "Movable",
            "Name": "HingeJointTest",
            "InitialAttributeValues": [
                { "Attribute": "POSITION", "Value": "(0.0,0.0,0.5)" },
                { "Attribute": "ROTATION", "Value": "(0.0,90.0,0.0)" }
            ],
            "SnapPoses": [
                { "Position": "(0.0,0.2,0.5)", "Rotation": "(0.0,0.0,90.0)" },
                { "Position": "(0.0,-0.2,0.53)", "Rotation": "(90.0,0.0,0.0)" }
            ]
        }
    ]
}
