{
  "Elements": [

    {
      "Type": "Slider",
      "Name": "ofen_tuer",
      "InitialAttributeValues": [
        {
          "Attribute": "VALUE",
          "Value": "0.0"
        }
      ],
      "MinPosition": {
        "x": 0.0,
        "y": 0.0,
        "z": 0.0
      },
      "MaxPosition": {
        "x": -1.5,
        "y": 0.0,
        "z": 0.0
      },
      "PositionResolution": 2
    },


    {
      "Type": "Button",
      "Name": "screen_ofen_rezepte",

      "Plane": {
        "x": 0.0,
        "y": 0.0,
        "z": 1.0
      },

      "Resolution": {
        "x": 100.0,
        "y": 100.0
      }
    },

    {
      "Type": "TouchArea",
      "Name": "screen_ofen_status",
      "Plane": {
        "x": 0.0,
        "y": 0.0,
        "z": 1.0
      },
      "Resolution": {
        "x": 100.0,
        "y": 100.0
      }
    },

    {
      "Type": "Slider",
      "Name": "lock_slider",
      "InitialAttributeValues": [
        {
          "Attribute": "VALUE",
          "Value": "0.0"
        }
      ],
      "MinPosition": {
        "x": 0.0,
        "y": 0.0,
        "z": 0
      },
      "MaxPosition": {
        "x": 0.0,
        "y": 0.0,
        "z": -0.1
      },
      "PositionResolution": 2
    },


    {
      "Type": "Slider",
      "Name": "grad",
      "InitialAttributeValues": [
        {
          "Attribute": "VALUE",
          "Value": "0.0"
        }
      ],
      "MinPosition": {
        "x": 0.0,
        "y": 0.0,
        "z": 0
      },
      "MaxPosition": {
        "x": 0.0,
        "y": 0.0,
        "z": -0.6
      },
      "PositionResolution": 4
    }


  ]
}
