﻿{
  "Elements": [
    {
      "Type": "Screen",
      "Name": "Screen",
      "Plane": {
        "x": 0.0,
        "y": 0.0,
        "z": 1.0
      },
      "Resolution": {
        "x": 400.0,
        "y": 150.0
      }
    },
    {
      "Type": "Screen",
      "Name": "TVLED",
      "Plane": {
        "x": 0.0,
        "y": 0.0,
        "z": 1.0
      },
      "Resolution": {
        "x": 400.0,
        "y": 150.0
      }
    }
  ]
}