﻿{
  "Elements": [
    {
      "Type": "Light",
      "Name": "LED",
      "EmissionColor": {
        "r": 1,
        "g": 0.15,
        "b": 0,
        "a": 1.0
      }
    },
	{
      "Type": "Light",
      "Name": "Heating_resistors",
      "EmissionColor": {
        "r": 1,
        "g": 0.36,
        "b": 0,
        "a": 1.0
      }
    },
	{
      "Type": "Light",
      "Name": "Bread1",
      "EmissionColor": {
        "r": 0.2,
        "g": 0.06,
        "b": 0.0,
        "a": 1.0
      }
    },
	{
      "Type": "Light",
      "Name": "Bread2",
      "EmissionColor": {
        "r": 0.2,
        "g": 0.06,
        "b": 0.0,
        "a": 1.0
      }
    },
	{
      "Type": "Light",
      "Name": "Bread3",
      "EmissionColor": {
        "r": 0.2,
        "g": 0.06,
        "b": 0.0,
        "a": 1.0
      }
    }
  ]
}