{
    "States": [
	    {
            "Name": "off.state",
            "Conditions": [
                {
                    "Type": "FloatValueVisualization",
                    "VisualizationElement": "Screen",
                    "Value": 0.0
                },
                {
                    "Type": "ScreenContentVisualization",
                    "VisualizationElement": "TVLED",
                    "FileName": "LED_off.png"
                }
            ]
        },
        {
            "Name": "channel1.state",
            "Conditions": [
                {
                    "Type": "ScreenContentVisualization",
                    "VisualizationElement": "Screen",
                    "FileName": "Channel1Video.mp4"
                },
                {
                    "Type": "ScreenContentVisualization",
                    "VisualizationElement": "TVLED",
                    "FileName": "LED_on.png"
                }
            ]
        },
        {
            "Name": "channel2.state",
            "Conditions": [
                {
                    "Type": "ScreenContentVisualization",
                    "VisualizationElement": "Screen",
                    "FileName": "https://archive.org/download/Rick_Astley_Never_Gonna_Give_You_Up/Rick_Astley_Never_Gonna_Give_You_Up.mp4"
                },
                {
                    "Type": "ScreenContentVisualization",
                    "VisualizationElement": "TVLED",
                    "FileName": "LED_on.png"
                }
            ]
        },
        {
            "Name": "channel3.state",
            "Conditions": [
                {
                    "Type": "ScreenContentVisualization",
                    "VisualizationElement": "Screen",
                    "FileName": "Channel3Image.JPG"
                },
                {
                    "Type": "ScreenContentVisualization",
                    "VisualizationElement": "TVLED",
                    "FileName": "LED_on.png"
                }
            ]
        }
    ]
}