{
  "Elements": [
    {
      "Type": "Button",
      "Name": "screen_herd_rezepte",

      "Plane": {
        "x": 0.0,
        "y": 0.0,
        "z": 1.0
      },

      "Resolution": {
        "x": 100.0,
        "y": 100.0
      }
    },

    {
      "Type": "Slider",
      "Name": "Heat_Slider",
      "InitialAttributeValues": [
        {
          "Attribute": "VALUE",
          "Value": "0.4"
        }
      ],
      "MinPosition": {
        "x": 0.0,
        "y": 0.0,
        "z": 0
      },
      "MaxPosition": {
        "x": 0.0,
        "y": 0.0,
        "z": -0.015
      },
      "PositionResolution": 2
    },


    {
      "Type": "Slider",
      "Name": "Herdstufe",
      "InitialAttributeValues": [
        {
          "Attribute": "VALUE",
          "Value": "0.0"
        }
      ],
      "MinPosition": {
        "x": 0.0,
        "y": 0.0,
        "z": 0
      },
      "MaxPosition": {
        "x": 0.0,
        "y": 0.0,
        "z": -0.095
      },
      "PositionResolution": 4
    },

    {
      "Type": "Slider",
      "Name": "Abzug",
      "InitialAttributeValues": [
        {
          "Attribute": "VALUE",
          "Value": "0.0"
        }
      ],
      "MinPosition": {
        "x": 0.0,
        "y": 0.0,
        "z": 0
      },
      "MaxPosition": {
        "x": 0.0,
        "y": 0.0,
        "z": -0.095
      },
      "PositionResolution": 2
    },


    {
      "Type": "Button",
      "Name": "Herd1",

      "Plane": {
        "x": 0.0,
        "y": 0.0,
        "z": 1.0
      },

      "Resolution": {
        "x": 100.0,
        "y": 100.0
      }
    },

    {
      "Type": "Button",
      "Name": "Herd2",

      "Plane": {
        "x": 0.0,
        "y": 0.0,
        "z": 1.0
      },

      "Resolution": {
        "x": 100.0,
        "y": 100.0
      }
    },

    {
      "Type": "Button",
      "Name": "Herd3",

      "Plane": {
        "x": 0.0,
        "y": 0.0,
        "z": 1.0
      },

      "Resolution": {
        "x": 100.0,
        "y": 100.0
      }
    },

    {
      "Type": "Button",
      "Name": "Herd4",

      "Plane": {
        "x": 0.0,
        "y": 0.0,
        "z": 1.0
      },

      "Resolution": {
        "x": 100.0,
        "y": 100.0
      }
    }
  ]
}
