%YAML 1.1
%TAG !u! tag:unity3d.com,2011:
--- !u!1 &2184612757763401737
GameObject:
  m_ObjectHideFlags: 0
  m_CorrespondingSourceObject: {fileID: 0}
  m_PrefabInstance: {fileID: 0}
  m_PrefabAsset: {fileID: 0}
  serializedVersion: 6
  m_Component:
  - component: {fileID: 4919575464885830196}
  m_Layer: 0
  m_Name: Kaffeemaschine_1
  m_TagString: Untagged
  m_Icon: {fileID: 0}
  m_NavMeshLayer: 0
  m_StaticEditorFlags: 0
  m_IsActive: 1
--- !u!4 &4919575464885830196
Transform:
  m_ObjectHideFlags: 0
  m_CorrespondingSourceObject: {fileID: 0}
  m_PrefabInstance: {fileID: 0}
  m_PrefabAsset: {fileID: 0}
  m_GameObject: {fileID: 2184612757763401737}
  m_LocalRotation: {x: 0, y: 0, z: 0, w: 1}
  m_LocalPosition: {x: 0, y: 0, z: 0}
  m_LocalScale: {x: 0.15, y: 0.15, z: 0.15}
  m_Children:
  - {fileID: 7647890183781908033}
  m_Father: {fileID: 0}
  m_RootOrder: 0
  m_LocalEulerAnglesHint: {x: 0, y: 0, z: 0}
--- !u!1001 &4913671555426934064
PrefabInstance:
  m_ObjectHideFlags: 0
  serializedVersion: 2
  m_Modification:
    m_TransformParent: {fileID: 4919575464885830196}
    m_Modifications:
    - target: {fileID: 350659525227884009, guid: f31dbe3a789f5334798ea6dd01490669,
        type: 3}
      propertyPath: m_Materials.Array.data[0]
      value: 
      objectReference: {fileID: 2100000, guid: d735701b394a9454c943d9371bc5bca7, type: 2}
    - target: {fileID: 2245812646044319460, guid: f31dbe3a789f5334798ea6dd01490669,
        type: 3}
      propertyPath: m_Name
      value: ON_OFF
      objectReference: {fileID: 0}
    - target: {fileID: 2475210199344091987, guid: f31dbe3a789f5334798ea6dd01490669,
        type: 3}
      propertyPath: m_Materials.Array.data[0]
      value: 
      objectReference: {fileID: 2100000, guid: d735701b394a9454c943d9371bc5bca7, type: 2}
    - target: {fileID: 2691407688639576523, guid: f31dbe3a789f5334798ea6dd01490669,
        type: 3}
      propertyPath: m_Name
      value: Kaffeemaschine2
      objectReference: {fileID: 0}
    - target: {fileID: 2805448657680550157, guid: f31dbe3a789f5334798ea6dd01490669,
        type: 3}
      propertyPath: m_Materials.Array.data[0]
      value: 
      objectReference: {fileID: 2100000, guid: d735701b394a9454c943d9371bc5bca7, type: 2}
    - target: {fileID: 3177932282565324535, guid: f31dbe3a789f5334798ea6dd01490669,
        type: 3}
      propertyPath: m_Materials.Array.data[0]
      value: 
      objectReference: {fileID: 2100000, guid: d735701b394a9454c943d9371bc5bca7, type: 2}
    - target: {fileID: 3243883580185722214, guid: f31dbe3a789f5334798ea6dd01490669,
        type: 3}
      propertyPath: m_Materials.Array.data[0]
      value: 
      objectReference: {fileID: 2100000, guid: d735701b394a9454c943d9371bc5bca7, type: 2}
    - target: {fileID: 3319748469323572081, guid: f31dbe3a789f5334798ea6dd01490669,
        type: 3}
      propertyPath: m_LocalPosition.x
      value: 0
      objectReference: {fileID: 0}
    - target: {fileID: 3319748469323572081, guid: f31dbe3a789f5334798ea6dd01490669,
        type: 3}
      propertyPath: m_LocalPosition.y
      value: 0
      objectReference: {fileID: 0}
    - target: {fileID: 3319748469323572081, guid: f31dbe3a789f5334798ea6dd01490669,
        type: 3}
      propertyPath: m_LocalPosition.z
      value: 0
      objectReference: {fileID: 0}
    - target: {fileID: 3319748469323572081, guid: f31dbe3a789f5334798ea6dd01490669,
        type: 3}
      propertyPath: m_LocalRotation.x
      value: 0
      objectReference: {fileID: 0}
    - target: {fileID: 3319748469323572081, guid: f31dbe3a789f5334798ea6dd01490669,
        type: 3}
      propertyPath: m_LocalRotation.y
      value: 0
      objectReference: {fileID: 0}
    - target: {fileID: 3319748469323572081, guid: f31dbe3a789f5334798ea6dd01490669,
        type: 3}
      propertyPath: m_LocalRotation.z
      value: 0
      objectReference: {fileID: 0}
    - target: {fileID: 3319748469323572081, guid: f31dbe3a789f5334798ea6dd01490669,
        type: 3}
      propertyPath: m_LocalRotation.w
      value: 1
      objectReference: {fileID: 0}
    - target: {fileID: 3319748469323572081, guid: f31dbe3a789f5334798ea6dd01490669,
        type: 3}
      propertyPath: m_RootOrder
      value: 0
      objectReference: {fileID: 0}
    - target: {fileID: 3319748469323572081, guid: f31dbe3a789f5334798ea6dd01490669,
        type: 3}
      propertyPath: m_LocalEulerAnglesHint.x
      value: 0
      objectReference: {fileID: 0}
    - target: {fileID: 3319748469323572081, guid: f31dbe3a789f5334798ea6dd01490669,
        type: 3}
      propertyPath: m_LocalEulerAnglesHint.y
      value: 0
      objectReference: {fileID: 0}
    - target: {fileID: 3319748469323572081, guid: f31dbe3a789f5334798ea6dd01490669,
        type: 3}
      propertyPath: m_LocalEulerAnglesHint.z
      value: 0
      objectReference: {fileID: 0}
    - target: {fileID: 3539799530802727250, guid: f31dbe3a789f5334798ea6dd01490669,
        type: 3}
      propertyPath: m_Materials.Array.data[0]
      value: 
      objectReference: {fileID: 2100000, guid: cab9b9cf89a8b9447a7a43beb1eaa535, type: 2}
    - target: {fileID: 6157690314474537115, guid: f31dbe3a789f5334798ea6dd01490669,
        type: 3}
      propertyPath: m_Materials.Array.data[0]
      value: 
      objectReference: {fileID: 2100000, guid: 46e5f6bfd5d20b64887a9086e9c2e7b6, type: 2}
    - target: {fileID: 6670782969282160529, guid: f31dbe3a789f5334798ea6dd01490669,
        type: 3}
      propertyPath: m_LocalScale.x
      value: 80
      objectReference: {fileID: 0}
    - target: {fileID: 6670782969282160529, guid: f31dbe3a789f5334798ea6dd01490669,
        type: 3}
      propertyPath: m_LocalScale.y
      value: 80
      objectReference: {fileID: 0}
    - target: {fileID: 6670782969282160529, guid: f31dbe3a789f5334798ea6dd01490669,
        type: 3}
      propertyPath: m_LocalScale.z
      value: 80
      objectReference: {fileID: 0}
    - target: {fileID: 7440556757818322035, guid: f31dbe3a789f5334798ea6dd01490669,
        type: 3}
      propertyPath: m_Materials.Array.data[0]
      value: 
      objectReference: {fileID: 2100000, guid: d735701b394a9454c943d9371bc5bca7, type: 2}
    - target: {fileID: 9056462141614985775, guid: f31dbe3a789f5334798ea6dd01490669,
        type: 3}
      propertyPath: m_Name
      value: Touchscreen
      objectReference: {fileID: 0}
    m_RemovedComponents: []
  m_SourcePrefab: {fileID: 100100000, guid: f31dbe3a789f5334798ea6dd01490669, type: 3}
--- !u!4 &7647890183781908033 stripped
Transform:
  m_CorrespondingSourceObject: {fileID: 3319748469323572081, guid: f31dbe3a789f5334798ea6dd01490669,
    type: 3}
  m_PrefabInstance: {fileID: 4913671555426934064}
  m_PrefabAsset: {fileID: 0}
