{
    "name": "VivianARCoreInteraction",
    "references": [
        "VivianCore",
        "TouchKit",
        "com.unity.multiplayer-hlapi.Runtime",
        "UnityEngine.XR.LegacyInputHelpers",
        "UnityEngine.SpatialTracking"
    ],
    "optionalUnityReferences": [],
    "includePlatforms": [],
    "excludePlatforms": [],
    "allowUnsafeCode": false,
    "overrideReferences": false,
    "precompiledReferences": [],
    "autoReferenced": true,
    "defineConstraints": [],
    "versionDefines": []
}