[
  {
    "account": "Account1",
    "last-name": "Nom",
    "first-name": "Prénom",
    "civility": "Monsieur",
    "customer-loyalty": "0.7",
    "credit": "0.6",
    "payment": "7",
    "email": "nom.prenom@email.fr",
    "password": "mot de passe",
    "card-number": "123",
    "validity-date": "12/98",
    "ccv": "781227",
    "provider": "mastercard"
  },

  {
    "account": "Account2",
    "last-name": "Nom2",
    "first-name": "Prénom2",
    "civility": "Madame",
    "customer-loyalty": "1.8",
    "credit": "1.9",
    "payment": "9",
    "email": "nom2.prenom2@email.fr",
    "password": "mot de passe2",
    "card-number": "123",
    "validity-date": "12/98",
    "ccv": "781227",
    "provider": "mastercard"
  },

  {
    "account": "Account3",
    "last-name": "Nom3",
    "first-name": "Prénom3",
    "civility": "Madame",
    "customer-loyalty": "3.8",
    "credit": "3.9",
    "payment": "3",
    "email": "nom3.prenom3@email.fr",
    "password": "mot de passe3",
    "card-number": "123",
    "validity-date": "12/98",
    "ccv": "781227",
    "provider": "mastercard"
  },

  {
    "account": "Account4",
    "last-name": "Nom4",
    "first-name": "Prénom4",
    "civility": "Monsieur",
    "customer-loyalty": "4.8",
    "credit": "4.9",
    "payment": "4",
    "email": "nom4.prenom@email.fr",
    "password": "mot de passe4",
    "card-number": "123",
    "validity-date": "11/98",
    "ccv": "781227",
    "provider": "mastercard"
  },

  {
    "account": "Account5",
    "last-name": "Nom5",
    "first-name": "Prénom5",
    "civility": "Madame",
    "customer-loyalty": "5.8",
    "credit": "5.9",
    "payment": "5",
    "email": "nom5.prenom2@email.fr",
    "password": "mot de passe5",
    "card-number": "123",
    "validity-date": "12/98",
    "ccv": "781227",
    "provider": "mastercard"
  },

  {
    "account": "Account6",
    "last-name": "Nom6",
    "first-name": "Prénom6",
    "civility": "Monsieur",
    "customer-loyalty": "6.8",
    "credit": "6.9",
    "payment": "6",
    "email": "nom6.prenom2@email.fr",
    "password": "mot de passe6"
  },

  {
    "account": "Account7",
    "last-name": "Nom7",
    "first-name": "Prénom7",
    "civility": "Madame",
    "customer-loyalty": "7.8",
    "credit": "7.9",
    "payment": "7",
    "email": "nom7.prenom2@email.fr",
    "password": "mot de passe"
  },

  {
    "account": "Account8",
    "last-name": "Nom8",
    "first-name": "Prénom8",
    "civility": "Madame",
    "customer-loyalty": "1.8",
    "credit": "1.9",
    "payment": "9",
    "email": "nom2.prenom2@email.fr",
    "password": "mot de passe2"
  }
]