[
  {
  "card-number": "123",
  "validity-date": "1998-12-25",
  "ccv": "781227",
  "clientAccountId": 1

  },
  {
    "card-number": "456",
    "validity-date": "1998-11-11",
    "ccv": "220498",
    "clientAccountId": 1
  },
  {
    "card-number": "789",
    "validity-date": "2020-10-15",
    "ccv": "753",
    "clientAccountId": 2
  },
  {
    "card-number": "321",
    "validity-date": "2020-12-25",
    "ccv": "951",
    "clientAccountId": 3
  },
  {
    "card-number": "654",
    "validity-date": "2020-12-17",
    "ccv": "159",
    "clientAccountId": 3
  },
  {
    "card-number": "987",
    "validity-date": "2021-04-22",
    "ccv": "357",
    "clientAccountId": 4
  },
  {
    "card-number": "147",
    "validity-date": "2019-11-01",
    "ccv": "444",
    "clientAccountId": 4
  },
  {
    "card-number": "258",
    "validity-date": "2021-04-22",
    "ccv": "11111",
    "clientAccountId": 5
  },
  {
    "card-number": "369",
    "validity-date": "2021-01-01",
    "ccv": "123456789",
    "clientAccountId": 6
  },
  {
    "card-number": "741",
    "validity-date": "1998-04-22",
    "ccv": "6431",
    "clientAccountId": 7
  },
  {
    "card-number": "852",
    "validity-date": "1998-08-24",
    "ccv": "2468",
    "clientAccountId": 8
  },
  {
    "card-number": "963",
    "validity-date": "2016-08-28",
    "ccv": "15",
    "clientAccountId": 8
  },
  {
    "card-number": "1234568",
    "validity-date": "2019-11-01",
    "ccv": "758",
    "clientAccountId": 9
  },
  {
    "card-number": "666",
    "validity-date": "2020-02-20",
    "ccv": "666",
    "clientAccountId": 10
  },
  {
    "card-number": "3",
    "validity-date": "1998-12-25",
    "ccv": "3",
    "clientAccountId": 10
  },
  {
    "card-number": "10",
    "validity-date": "2010-10-10",
    "ccv": "1010",
    "clientAccountId": 11
  },
  {
    "card-number": "9",
    "validity-date": "2009-09-09",
    "ccv": "15246",
    "clientAccountId": 12
  },
  {
    "card-number": "8",
    "validity-date": "2008-08-08",
    "ccv": "8888",
    "clientAccountId": 12
  },
  {
    "card-number": "7",
    "validity-date": "2007-07-07",
    "ccv": "7777",
    "clientAccountId": 12
  },
  {
    "card-number": "6",
    "validity-date": "2006-06-06",
    "ccv": "6666",
    "clientAccountId": 13
  },
  {
    "card-number": "5",
    "validity-date": "2005-02-02",
    "ccv": "5555",
    "clientAccountId": 13
  },
  {
    "card-number": "4",
    "validity-date": "2004-04-04",
    "ccv": "4444",
    "clientAccountId": 14
  },
  {
    "card-number": "3",
    "validity-date": "2003-03-03",
    "ccv": "333",
    "clientAccountId": 15
  },
  {
    "card-number": "2",
    "validity-date": "2002-02-02",
    "ccv": "22",
    "clientAccountId": 16
  },
  {
    "card-number": "1",
    "validity-date": "2001-01-01",
    "ccv": "1",
    "clientAccountId": 17
  },
  {
    "card-number": "0",
    "validity-date": "2000-01-25",
    "ccv": "0",
    "clientAccountId": 18
  },
  {
    "card-number": "531",
    "validity-date": "2010-12-25",
    "ccv": "759",
    "clientAccountId": 18
  },
  {
    "card-number": "564",
    "validity-date": "2015-12-25",
    "ccv": "647",
    "clientAccountId": 19
  },
  {
    "card-number": "9494",
    "validity-date": "2006-03-17",
    "ccv": "15546",
    "clientAccountId": 19
  },
  {
    "card-number": "4564",
    "validity-date": "2025-12-25",
    "ccv": "26547",
    "clientAccountId": 20
  },
  {
    "card-number": "15467",
    "validity-date": "2030-12-30",
    "ccv": "245",
    "clientAccountId": 20
  },
  {
    "card-number": "8532",
    "validity-date": "2019-08-20",
    "ccv": "38882",
    "clientAccountId": 21
  },
  {
    "card-number": "95120",
    "validity-date": "1939-07-22",
    "ccv": "4561",
    "clientAccountId": 22
  },
  {
    "card-number": "75009",
    "validity-date": "1945-11-10",
    "ccv": "16489",
    "clientAccountId": 23
  },
  {
    "card-number": "75010",
    "validity-date": "1914-12-25",
    "ccv": "1647",
    "clientAccountId": 24
  },
  {
    "card-number": "7391",
    "validity-date": "1918-12-25",
    "ccv": "79516",
    "clientAccountId": 25
  },
  {
    "card-number": "56418",
    "validity-date": "2030-12-25",
    "ccv": "4264",
    "clientAccountId": 26
  },
  {
    "card-number": "16547",
    "validity-date": "2018-12-30",
    "ccv": "28794",
    "clientAccountId": 26
  },
  {
    "card-number": "124356",
    "validity-date": "2024-12-25",
    "ccv": "1648",
    "clientAccountId": 27
  },
  {
    "card-number": "13579",
    "validity-date": "2019-09-09",
    "ccv": "7954",
    "clientAccountId": 28
  },
  {
    "card-number": "1647",
    "validity-date": "2070-12-25",
    "ccv": "1657",
    "clientAccountId": 28
  },
  {
    "card-number": "012357",
    "validity-date": "2017-11-23",
    "ccv": "134679",
    "clientAccountId": 28
  },
  {
    "card-number": "12358",
    "validity-date": "1998-05-11",
    "ccv": "75486",
    "clientAccountId": 28
  },
  {
    "card-number": "2467678",
    "validity-date": "2010-11-24",
    "ccv": "2222",
    "clientAccountId": 29
  },
  {
    "card-number": "555525",
    "validity-date": "2012-12-22",
    "ccv": "645135",
    "clientAccountId": 29
  },
  {
    "card-number": "95",
    "validity-date": "1998-12-18",
    "ccv": "45646",
    "clientAccountId": 29
  },
  {
    "card-number": "684613",
    "validity-date": "2022-02-28",
    "ccv": "43434",
    "clientAccountId": 29
  },
  {
    "card-number": "13334334",
    "validity-date": "2019-02-14",
    "ccv": "2134",
    "clientAccountId": 22
  },
  {
    "card-number": "01",
    "validity-date": "2001-01-01",
    "ccv": "01",
    "clientAccountId": 23
  },
  {
    "card-number": "123",
    "validity-date": "1998-12-25",
    "ccv": "781227",
    "clientAccountId": 25
  }
]