{
  "stockMovements": [{
    "id": 1,
    "date": "2020-10-23 23:20:00",
    "warehouse-id": 1,
    "recipient-id": 1,
    "recipient-type": "Shop",
    "products": [{
      "product-code": "HUSDSD",
      "quantity": 1
    }]
  }]
}