[
  {
    "product_code": "AABBCCDDEE",
    "product_family": "Fam1",
    "product_description": "Desc1",
    "min_quantity": 1,
    "packaging": 1,
    "price": 5,
    "assortment_type": "Ass1",
    "createdAt": "2020-10-24 14:53:06",
    "updatedAt": "2020-10-24 14:53:07"
  }
]