[
  {
    "street": "Blomet",
    "street_number": "11",
    "city": "Paris",
    "zipcode": "75015",
    "country": "France"
  },
  {
    "street": "Rivoli",
    "street_number": "10",
    "city": "Paris",
    "zipcode": "75001",
    "country": "France"
  },
  {
    "street": "Descartes",
    "street_number": "60",
    "city": "Strasbourg",
    "zipcode": "67200",
    "country": "France"
  },
  {
    "street": "Chaligny",
    "street_number": "6",
    "city": "Nice",
    "zipcode": "06000",
    "country": "France"
  },
  {
    "street": "Charles Corbeau",
    "street_number": "32",
    "zipcode": "45400",
    "city": "Fleury-les-aubrais",
    "country": "France"
  },
  {
    "street": "Epeule",
    "street_number": "45",
    "city": "Rouen",
    "zipcode": "76000",
    "country": "France"
  },
  {
    "street": "Saint-Nicolas",
    "street_number": "24",
    "city": "Tours",
    "zipcode": "37100",
    "country": "France"
  }
]