[
  {
    "product_code": "4003915026154",
    "product_family": "Maison",
    "product_description": "DORMIPUR Oreiller à mémoire de forme MEMOVITA 60x60 cm",
    "min_quantity": 100,
    "packaging": 1,
    "price": 138.03,
    "assortment_type": "Web"
  },
  {
    "product_code": "4047443105936",
    "product_family": "Bricolage",
    "product_description": "ESSEBAGNO SIERRA EVIER RESINE NOIRE 1 GRANDE CUVE + 1 EGOUTTOIR Evier en résine noir 1000x500 mmHauteur 210 mm1 cuve",
    "min_quantity": 100,
    "packaging": 1,
    "price": 50.4,
    "assortment_type": "Web"
  },
  {
    "product_code": "4047443190673",
    "product_family": "Image et Son",
    "product_description": "SAMSUNG 65TU7022 TV LED 4K UHD - 65 \" (163cm) - HDR10 + ",
    "min_quantity": 65,
    "packaging": 1,
    "price": 178.2,
    "assortment_type": "Web"
  },
  {
    "product_code": "4047443191212",
    "product_family": "Electromenager",
    "product_description": "WPRO FRI101 Spray nettoyant pour Réfrigérateur / Congélateur 500ml",
    "min_quantity": 1000,
    "packaging": 1,
    "price": 171.6,
    "assortment_type": "Web"
  },
  {
    "product_code": "4047443197405",
    "product_family": "Electromenager",
    "product_description": "BEKO REC52S - Réfrigérateur congélateur bas - 450L (326+124) - Froid ventilé - A+ - L 70cm x H 192cm - Silver",
    "min_quantity": 45,
    "packaging": 1,
    "price": 289.2,
    "assortment_type": "Web"
  },
  {
    "product_code": "5711045076411",
    "product_family": "Bricolage",
    "product_description": "OCEANIC Colonne de douche - Mitigeur thermostatique - Pomme haute ronde diamètre 20 cm - Chrome",
    "min_quantity": 11,
    "packaging": 1,
    "price": 291.2,
    "assortment_type": "Web"
  },
  {
    "product_code": "8714574584614",
    "product_family": "Electromenager",
    "product_description": "PHILIPS QP6620/64 - Rasoir/Tondeuse OneBlade Pro - Visage et Corps",
    "min_quantity": 10,
    "packaging": 1,
    "price": 145.2,
    "assortment_type": "Web"
  },
  {
    "product_code": "X1-10",
    "product_family": "TV",
    "product_description": "TV:P3-10",
    "min_quantity": 15,
    "packaging": 2,
    "price": 10.56,
    "assortment_type": "Web"
  },
  {
    "product_code": "X1-4",
    "product_family": "TV",
    "product_description": "TV:P3-4",
    "min_quantity": 15,
    "packaging": 4,
    "price": 344.52,
    "assortment_type": "Web"
  }
]