module gitlab.skypicker.com/platform/migration-and-infrastructure-squad/vault-k8s-webhook-mutator

require (
	contrib.go.opencensus.io/exporter/ocagent v0.4.4 // indirect
	github.com/Azure/azure-sdk-for-go v25.1.0+incompatible // indirect
	github.com/Azure/go-autorest v11.4.0+incompatible // indirect
	github.com/NYTimes/gziphandler v1.1.0 // indirect
	github.com/SAP/go-hdb v0.13.2 // indirect
	github.com/aliyun/alibaba-cloud-sdk-go v0.0.0-20190218072225-b13ed3c450d9 // indirect
	github.com/araddon/gou v0.0.0-20190110011759-c797efecbb61 // indirect
	github.com/aws/aws-sdk-go v1.16.36 // indirect
	github.com/boombuler/barcode v1.0.0 // indirect
	github.com/briankassouf/jose v0.9.1 // indirect
	github.com/cenkalti/backoff v2.1.1+incompatible // indirect
	github.com/centrify/cloud-golang-sdk v0.0.0-20190214225812-119110094d0f // indirect
	github.com/chrismalek/oktasdk-go v0.0.0-20181212195951-3430665dfaa0 // indirect
	github.com/containerd/continuity v0.0.0-20181203112020-004b46473808 // indirect
	github.com/coreos/etcd v3.3.12+incompatible // indirect
	github.com/coreos/go-oidc v2.0.0+incompatible // indirect
	github.com/coreos/go-semver v0.2.0 // indirect
	github.com/coreos/go-systemd v0.0.0-20190212144455-93d5ec2c7f76 // indirect
	github.com/coreos/pkg v0.0.0-20180928190104-399ea9e2e55f // indirect
	github.com/dancannon/gorethink v4.0.0+incompatible // indirect
	github.com/denisenkom/go-mssqldb v0.0.0-20190204142019-df6d76eb9289 // indirect
	github.com/dimchansky/utfbom v1.1.0 // indirect
	github.com/duosecurity/duo_api_golang v0.0.0-20190107154727-539434bf0d45 // indirect
	github.com/fullsailor/pkcs7 v0.0.0-20180613152042-8306686428a5 // indirect
	github.com/gammazero/deque v0.0.0-20190130191400-2afb3858e9c7 // indirect
	github.com/gammazero/workerpool v0.0.0-20181230203049-86a96b5d5d92 // indirect
	github.com/garyburd/redigo v1.6.0 // indirect
	github.com/go-errors/errors v1.0.1 // indirect
	github.com/go-ldap/ldap v3.0.1+incompatible // indirect
	github.com/go-sql-driver/mysql v1.4.1 // indirect
	github.com/go-stomp/stomp v2.0.2+incompatible // indirect
	github.com/gocql/gocql v0.0.0-20190208221138-c53c3654dc8a // indirect
	github.com/golang/groupcache v0.0.0-20190129154638-5b532d6fd5ef // indirect
	github.com/googleapis/gax-go v2.0.2+incompatible // indirect
	github.com/googleapis/gnostic v0.2.0 // indirect
	github.com/gorhill/cronexpr v0.0.0-20180427100037-88b0669f7d75 // indirect
	github.com/gorilla/websocket v1.4.0 // indirect
	github.com/gregjones/httpcache v0.0.0-20190212212710-3befbb6ad0cc // indirect
	github.com/grpc-ecosystem/go-grpc-middleware v1.0.0 // indirect
	github.com/grpc-ecosystem/go-grpc-prometheus v1.2.0 // indirect
	github.com/hashicorp/consul v1.4.2 // indirect
	github.com/hashicorp/go-gcp-common v0.0.0-20180425173946-763e39302965 // indirect
	github.com/hashicorp/go-hclog v0.7.0 // indirect
	github.com/hashicorp/go-plugin v0.0.0-20190212232519-b838ffee39ce // indirect
	github.com/hashicorp/go-retryablehttp v0.5.2 // indirect
	github.com/hashicorp/go-rootcerts v1.0.0 // indirect
	github.com/hashicorp/go-sockaddr v1.0.1 // indirect
	github.com/hashicorp/go-version v1.1.0 // indirect
	github.com/hashicorp/nomad v0.8.7 // indirect
	github.com/hashicorp/serf v0.8.2 // indirect
	github.com/hashicorp/vault v1.0.3
	github.com/hashicorp/vault-plugin-auth-alicloud v0.0.0-20181109180636-f278a59ca3e8 // indirect
	github.com/hashicorp/vault-plugin-auth-azure v0.0.0-20190201222632-0af1d040b5b3 // indirect
	github.com/hashicorp/vault-plugin-auth-centrify v0.0.0-20180816201131-66b0a34a58bf // indirect
	github.com/hashicorp/vault-plugin-auth-gcp v0.0.0-20190201215414-7d4c2101e7d0 // indirect
	github.com/hashicorp/vault-plugin-auth-jwt v0.0.0-20190214185457-a61556be6730 // indirect
	github.com/hashicorp/vault-plugin-auth-kubernetes v0.0.0-20190201222209-db96aa4ab438 // indirect
	github.com/hashicorp/vault-plugin-secrets-ad v0.0.0-20190131222416-4796d9980125 // indirect
	github.com/hashicorp/vault-plugin-secrets-alicloud v0.0.0-20190131211812-b0abe36195cb // indirect
	github.com/hashicorp/vault-plugin-secrets-azure v0.0.0-20181207232500-0087bdef705a // indirect
	github.com/hashicorp/vault-plugin-secrets-gcp v0.0.0-20180921173200-d6445459e80c // indirect
	github.com/hashicorp/vault-plugin-secrets-gcpkms v0.0.0-20190116164938-d6b25b0b4a39 // indirect
	github.com/hashicorp/vault-plugin-secrets-kv v0.0.0-20190115203747-edbfe287c5d9 // indirect
	github.com/imdario/mergo v0.3.7 // indirect
	github.com/influxdata/influxdb v1.7.4 // indirect
	github.com/influxdata/platform v0.0.0-20190117200541-d500d3cf5589 // indirect
	github.com/jeffchao/backoff v0.0.0-20140404060208-9d7fd7aa17f2 // indirect
	github.com/jefferai/jsonx v1.0.0 // indirect
	github.com/jonboulle/clockwork v0.1.0 // indirect
	github.com/keybase/go-crypto v0.0.0-20181127160227-255a5089e85a // indirect
	github.com/mattbaird/elastigo v0.0.0-20170123220020-2fe47fd29e4b // indirect
	github.com/michaelklishin/rabbit-hole v1.5.0 // indirect
	github.com/mitchellh/hashstructure v1.0.0 // indirect
	github.com/mitchellh/pointerstructure v0.0.0-20170205204203-f2329fcfa9e2 // indirect
	github.com/ory-am/common v0.4.0 // indirect
	github.com/ory/dockertest v3.3.4+incompatible // indirect
	github.com/pborman/uuid v1.2.0 // indirect
	github.com/peterbourgon/diskv v2.0.1+incompatible // indirect
	github.com/pkg/errors v0.8.1
	github.com/pquerna/cachecontrol v0.0.0-20180517163645-1555304b9b35 // indirect
	github.com/pquerna/otp v1.1.0 // indirect
	github.com/ryanuber/go-glob v1.0.0 // indirect
	github.com/samuel/go-zookeeper v0.0.0-20180130194729-c4fab1ac1bec // indirect
	github.com/sirupsen/logrus v1.3.0 // indirect
	github.com/slok/kubewebhook v0.2.0
	github.com/soheilhy/cmux v0.1.4 // indirect
	github.com/streadway/amqp v0.0.0-20190214183023-884228600bc9 // indirect
	github.com/tidwall/gjson v1.2.1
	github.com/tidwall/match v1.0.1 // indirect
	github.com/tidwall/pretty v0.0.0-20180105212114-65a9db5fad51 // indirect
	github.com/tmc/grpc-websocket-proxy v0.0.0-20190109142713-0ad062ec5ee5 // indirect
	github.com/ugorji/go/codec v0.0.0-20190204201341-e444a5086c43 // indirect
	github.com/xiang90/probing v0.0.0-20190116061207-43a291ad63a2 // indirect
	go.opencensus.io v0.19.0 // indirect
	golang.org/x/crypto v0.0.0-20190211182817-74369b46fc67 // indirect
	golang.org/x/oauth2 v0.0.0-20190212230446-3e8b2be13635 // indirect
	golang.org/x/sys v0.0.0-20190215142949-d0b11bdaac8a // indirect
	golang.org/x/time v0.0.0-20181108054448-85acf8d2951c // indirect
	google.golang.org/api v0.1.0 // indirect
	google.golang.org/grpc v1.18.0 // indirect
	gopkg.in/asn1-ber.v1 v1.0.0-20181015200546-f715ec2f112d // indirect
	gopkg.in/gorethink/gorethink.v4 v4.1.0 // indirect
	gopkg.in/ory-am/dockertest.v2 v2.2.3 // indirect
	gopkg.in/square/go-jose.v2 v2.2.2 // indirect
	k8s.io/api v0.0.0-20190111032252-67edc246be36
	k8s.io/apimachinery v0.0.0-20190216013122-f05b8decd79c
	k8s.io/client-go v10.0.0+incompatible
	k8s.io/klog v0.2.0 // indirect
	layeh.com/radius v0.0.0-20190118135028-0f678f039617 // indirect
	sigs.k8s.io/yaml v1.1.0 // indirect
)
