[
  {
    "model": "shopapp.product",
    "pk": 1,
    "fields": {
      "name": "Laptop",
      "description": "",
      "price": "1999.00",
      "discount": 0,
      "created_at": "2023-04-19T17:19:15.001Z",
      "archived": false
    }
  },
  {
    "model": "shopapp.product",
    "pk": 2,
    "fields": {
      "name": "Desktop",
      "description": "Lorem ipsum dolor sit amet. Eum officiis nesciunt Et accusantium ex unde incidunt aut internos voluptate vel optio exercitationem. Eum totam inciduntvel culpa 33 harum debitis. Eum praesentium inventore ad labore laudantium Aut fuga in nisi eveniet sed galisum corporis. Est voluptatum fugit sit molestiae earumCum fugit. Aut praesentium itaque eum numquam inciduntsit nihil. Hic natus nisi 33 consequuntur voluptateAut enim. Et dolor dolorum aut molestiae explicaboUt dignissimos et magnam numquam. In harum placeatEum laborum ex quibusdam atque id nisi vitae sed rerum incidunt et quos eligendi!",
      "price": "2599.00",
      "discount": 10,
      "created_at": "2023-04-19T17:19:15.001Z",
      "archived": true
    }
  },
  {
    "model": "shopapp.product",
    "pk": 3,
    "fields": {
      "name": "Smartphone",
      "description": "",
      "price": "987.00",
      "discount": 25,
      "created_at": "2023-04-19T17:19:15.001Z",
      "archived": true
    }
  },
  {
    "model": "shopapp.product",
    "pk": 4,
    "fields": {
      "name": "Phone",
      "description": "Good phone",
      "price": "23000.00",
      "discount": 0,
      "created_at": "2023-04-23T09:02:03.441Z",
      "archived": false
    }
  },
  {
    "model": "shopapp.product",
    "pk": 6,
    "fields": {
      "name": "IPhone",
      "description": "iPhone 13 great",
      "price": "85000.00",
      "discount": 0,
      "created_at": "2023-04-23T09:35:31.056Z",
      "archived": false
    }
  },
  {
    "model": "shopapp.order",
    "pk": 1,
    "fields": {
      "delivery_address": "Wall Street",
      "promocode": "SALE-54",
      "created_at": "2023-04-20T05:35:27.832Z",
      "user": 1,
      "products": [
        2,
        1,
        3
      ]
    }
  },
  {
    "model": "shopapp.order",
    "pk": 2,
    "fields": {
      "delivery_address": "Krasnodar",
      "promocode": "",
      "created_at": "2023-04-23T10:38:41.083Z",
      "user": 1,
      "products": [
        3
      ]
    }
  }
]