%YAML 1.1
%TAG !u! tag:unity3d.com,2011:
--- !u!114 &11400000
MonoBehaviour:
  m_ObjectHideFlags: 0
  m_CorrespondingSourceObject: {fileID: 0}
  m_PrefabInstance: {fileID: 0}
  m_PrefabAsset: {fileID: 0}
  m_GameObject: {fileID: 0}
  m_Enabled: 1
  m_EditorHideFlags: 0
  m_Script: {fileID: 11500000, guid: 33f12a0586d749a4e86f3fca17ab8367, type: 3}
  m_Name: "O112 - Z\xE1suvka"
  m_EditorClassIdentifier: 
  uniqueId: 112
  editorName: "O112 - Z\xE1suvka"
  names:
  - cs: "Z\xE1suvka"
    en: 
  currentNameIndex: 0
  currentDialogEntryPoint: {fileID: 114444622900498820, guid: 50fa6ee61af04d7408178f932b4ec0f7,
    type: 2}
  currentExamineEntryPoint: {fileID: 114308858508615492, guid: 27c2cb110cc0c3048b5265fae388abfe,
    type: 2}
  defaultDialogEntryPoint: {fileID: 114444622900498820, guid: 50fa6ee61af04d7408178f932b4ec0f7,
    type: 2}
  defaultExamineEntryPoint: {fileID: 114308858508615492, guid: 27c2cb110cc0c3048b5265fae388abfe,
    type: 2}
  visible: 1
  mouseInteractive: 1
  talkative: 1
  defaultVisible: 1
  defaultInteractive: 1
  defaultTalkative: 1
