%YAML 1.1
%TAG !u! tag:unity3d.com,2011:
--- !u!114 &11400000
MonoBehaviour:
  m_ObjectHideFlags: 0
  m_CorrespondingSourceObject: {fileID: 0}
  m_PrefabInstance: {fileID: 0}
  m_PrefabAsset: {fileID: 0}
  m_GameObject: {fileID: 0}
  m_Enabled: 1
  m_EditorHideFlags: 0
  m_Script: {fileID: 11500000, guid: 08da045f5693d3f418cf6eb082a7dfda, type: 3}
  m_Name: ItemUse
  m_EditorClassIdentifier: 
  inventory: {fileID: 11400000, guid: 5478360e3443d0a4a8538d6091976897, type: 2}
