%YAML 1.1
%TAG !u! tag:unity3d.com,2011:
--- !u!114 &11400000
MonoBehaviour:
  m_ObjectHideFlags: 0
  m_CorrespondingSourceObject: {fileID: 0}
  m_PrefabInstance: {fileID: 0}
  m_PrefabAsset: {fileID: 0}
  m_GameObject: {fileID: 0}
  m_Enabled: 1
  m_EditorHideFlags: 0
  m_Script: {fileID: 11500000, guid: 33f12a0586d749a4e86f3fca17ab8367, type: 3}
  m_Name: "O101 - V\xFDchod z maringotky"
  m_EditorClassIdentifier: 
  uniqueId: 101
  editorName: "O101 - V\xFDchod z maringotky"
  names:
  - cs: "V\xFDchod z maringotky"
    en: 
  currentNameIndex: 0
  currentDialogEntryPoint: {fileID: 114955102495870970, guid: bcba98a7066ad514c9bfdca7c6949180,
    type: 2}
  currentExamineEntryPoint: {fileID: 114071140222160278, guid: df26d83e0c2e57c47a2e9238dd7ca4a6,
    type: 2}
  defaultDialogEntryPoint: {fileID: 114955102495870970, guid: bcba98a7066ad514c9bfdca7c6949180,
    type: 2}
  defaultExamineEntryPoint: {fileID: 114071140222160278, guid: df26d83e0c2e57c47a2e9238dd7ca4a6,
    type: 2}
  visible: 1
  mouseInteractive: 1
  talkative: 1
  defaultVisible: 1
  defaultInteractive: 1
  defaultTalkative: 1
