%YAML 1.1
%TAG !u! tag:unity3d.com,2011:
--- !u!114 &11400000
MonoBehaviour:
  m_ObjectHideFlags: 0
  m_CorrespondingSourceObject: {fileID: 0}
  m_PrefabInstance: {fileID: 0}
  m_PrefabAsset: {fileID: 0}
  m_GameObject: {fileID: 0}
  m_Enabled: 1
  m_EditorHideFlags: 0
  m_Script: {fileID: 11500000, guid: 33f12a0586d749a4e86f3fca17ab8367, type: 3}
  m_Name: "O102 - Ventil\xE1tor"
  m_EditorClassIdentifier: 
  uniqueId: 102
  editorName: "O102 - Ventil\xE1tor"
  names:
  - cs: "Ventil\xE1tor"
    en: 
  currentNameIndex: 0
  currentDialogEntryPoint: {fileID: 114985959672942724, guid: 084302d09fd64bb40b11980f69b34c92,
    type: 2}
  currentExamineEntryPoint: {fileID: 114754715722783834, guid: 4419ca487a7c89843a736628c14c7218,
    type: 2}
  defaultDialogEntryPoint: {fileID: 114985959672942724, guid: 084302d09fd64bb40b11980f69b34c92,
    type: 2}
  defaultExamineEntryPoint: {fileID: 114754715722783834, guid: 4419ca487a7c89843a736628c14c7218,
    type: 2}
  visible: 1
  mouseInteractive: 1
  talkative: 1
  defaultVisible: 1
  defaultInteractive: 1
  defaultTalkative: 1
