%YAML 1.1
%TAG !u! tag:unity3d.com,2011:
--- !u!114 &11400000
MonoBehaviour:
  m_ObjectHideFlags: 0
  m_CorrespondingSourceObject: {fileID: 0}
  m_PrefabInstance: {fileID: 0}
  m_PrefabAsset: {fileID: 0}
  m_GameObject: {fileID: 0}
  m_Enabled: 1
  m_EditorHideFlags: 0
  m_Script: {fileID: 11500000, guid: ed88e7c9586ecee4fa1f22cd57b138a9, type: 3}
  m_Name: Inventory
  m_EditorClassIdentifier: 
  items:
  - {fileID: 11400000, guid: bcbad7e592c90074182f8edb3d31867e, type: 2}
  itemCombinationsManager: {fileID: 11400000, guid: 8c6ff8472e85d554bab2ad16092b3bd7,
    type: 2}
  oddness: 0
  inventoryChanged: 1
