%YAML 1.1
%TAG !u! tag:unity3d.com,2011:
--- !u!114 &11400000
MonoBehaviour:
  m_ObjectHideFlags: 0
  m_CorrespondingSourceObject: {fileID: 0}
  m_PrefabInternal: {fileID: 0}
  m_GameObject: {fileID: 0}
  m_Enabled: 1
  m_EditorHideFlags: 0
  m_Script: {fileID: 11500000, guid: 687613c9ccb6ce440b2f3c4d3ddd4b02, type: 3}
  m_Name: IsInInventory
  m_EditorClassIdentifier: 
  inventory: {fileID: 11400000, guid: 5478360e3443d0a4a8538d6091976897, type: 2}
