%YAML 1.1
%TAG !u! tag:unity3d.com,2011:
--- !u!114 &11400000
MonoBehaviour:
  m_ObjectHideFlags: 0
  m_CorrespondingSourceObject: {fileID: 0}
  m_PrefabInstance: {fileID: 0}
  m_PrefabAsset: {fileID: 0}
  m_GameObject: {fileID: 0}
  m_Enabled: 1
  m_EditorHideFlags: 0
  m_Script: {fileID: 11500000, guid: 33f12a0586d749a4e86f3fca17ab8367, type: 3}
  m_Name: O109 - Mikrovlnka
  m_EditorClassIdentifier: 
  uniqueId: 109
  editorName: O109 - Mikrovlnka
  names:
  - cs: Mikrovlnka
    en: 
  currentNameIndex: 0
  currentDialogEntryPoint: {fileID: 114339626465635098, guid: 08ba9f158859b854a9ac5852abd26ae4,
    type: 2}
  currentExamineEntryPoint: {fileID: 114267437350259980, guid: a0462265cccbea84aa7f6c50c1ea8879,
    type: 2}
  defaultDialogEntryPoint: {fileID: 114339626465635098, guid: 08ba9f158859b854a9ac5852abd26ae4,
    type: 2}
  defaultExamineEntryPoint: {fileID: 114267437350259980, guid: a0462265cccbea84aa7f6c50c1ea8879,
    type: 2}
  visible: 1
  mouseInteractive: 1
  talkative: 1
  defaultVisible: 1
  defaultInteractive: 1
  defaultTalkative: 1
