%YAML 1.1
%TAG !u! tag:unity3d.com,2011:
--- !u!114 &11400000
MonoBehaviour:
  m_ObjectHideFlags: 0
  m_CorrespondingSourceObject: {fileID: 0}
  m_PrefabInstance: {fileID: 0}
  m_PrefabAsset: {fileID: 0}
  m_GameObject: {fileID: 0}
  m_Enabled: 1
  m_EditorHideFlags: 0
  m_Script: {fileID: 11500000, guid: 9b78f92349656be47bccc2e4cba84f1c, type: 3}
  m_Name: ItemCombinationsManager
  m_EditorClassIdentifier: 
  itemEntries:
  - {fileID: 114445573220935692}
  - {fileID: 114207653131543510}
  - {fileID: 114171353836761824}
  - {fileID: 114143411532165864}
  - {fileID: 114377005194268108}
  characterEntries:
  - {fileID: 114969408125185110}
  referenceLinkHelper: {fileID: 11400000, guid: 0ba0596da8827ef438cef961ec1ea5e3,
    type: 2}
  lastEntryIndex: 14
--- !u!114 &114143411532165864
MonoBehaviour:
  m_ObjectHideFlags: 0
  m_CorrespondingSourceObject: {fileID: 0}
  m_PrefabInstance: {fileID: 0}
  m_PrefabAsset: {fileID: 0}
  m_GameObject: {fileID: 0}
  m_Enabled: 1
  m_EditorHideFlags: 0
  m_Script: {fileID: 11500000, guid: 29e288510afce78478f01d6d3d350be5, type: 3}
  m_Name: ItemItemComb-12
  m_EditorClassIdentifier: 
  object1: {fileID: 11400000, guid: cebf7f3c376c8994bb99efb171ed2569, type: 2}
  object2: {fileID: 11400000, guid: 9d468eabd2c118a4798413760e698e47, type: 2}
  entryPoint: {fileID: 114776643382480784, guid: 2faafb64ac9dcc34a8a6e359722914f5,
    type: 2}
  corruptionReport: 
--- !u!114 &114171353836761824
MonoBehaviour:
  m_ObjectHideFlags: 0
  m_CorrespondingSourceObject: {fileID: 0}
  m_PrefabInstance: {fileID: 0}
  m_PrefabAsset: {fileID: 0}
  m_GameObject: {fileID: 0}
  m_Enabled: 1
  m_EditorHideFlags: 0
  m_Script: {fileID: 11500000, guid: 29e288510afce78478f01d6d3d350be5, type: 3}
  m_Name: ItemItemComb-11
  m_EditorClassIdentifier: 
  object1: {fileID: 11400000, guid: fdd5da381b27d0d4886612b4b158a21a, type: 2}
  object2: {fileID: 11400000, guid: 041afd2b506f1eb42ba576eabcf5daa7, type: 2}
  entryPoint: {fileID: 114081573200748514, guid: 971c2f1a158c4c346875ae5801efa86f,
    type: 2}
  corruptionReport: 
--- !u!114 &114207653131543510
MonoBehaviour:
  m_ObjectHideFlags: 0
  m_CorrespondingSourceObject: {fileID: 0}
  m_PrefabInstance: {fileID: 0}
  m_PrefabAsset: {fileID: 0}
  m_GameObject: {fileID: 0}
  m_Enabled: 1
  m_EditorHideFlags: 0
  m_Script: {fileID: 11500000, guid: 29e288510afce78478f01d6d3d350be5, type: 3}
  m_Name: ItemItemComb-10
  m_EditorClassIdentifier: 
  object1: {fileID: 11400000, guid: 041afd2b506f1eb42ba576eabcf5daa7, type: 2}
  object2: {fileID: 11400000, guid: 532f8d20495fc7f4d89ab4d50dda2c6a, type: 2}
  entryPoint: {fileID: 114763809991321118, guid: f37758ca5d165844cabe5267ba37450c,
    type: 2}
  corruptionReport: 
--- !u!114 &114377005194268108
MonoBehaviour:
  m_ObjectHideFlags: 0
  m_CorrespondingSourceObject: {fileID: 0}
  m_PrefabInstance: {fileID: 0}
  m_PrefabAsset: {fileID: 0}
  m_GameObject: {fileID: 0}
  m_Enabled: 1
  m_EditorHideFlags: 0
  m_Script: {fileID: 11500000, guid: 29e288510afce78478f01d6d3d350be5, type: 3}
  m_Name: ItemItemComb-13
  m_EditorClassIdentifier: 
  object1: {fileID: 11400000, guid: c25b1a001062aa349820ea3ad9835209, type: 2}
  object2: {fileID: 11400000, guid: 9554891a7586fac4c970e613eea140b6, type: 2}
  entryPoint: {fileID: 114917114498212316, guid: 60397006187776241b131f5e152a48e3,
    type: 2}
  corruptionReport: 
--- !u!114 &114445573220935692
MonoBehaviour:
  m_ObjectHideFlags: 0
  m_CorrespondingSourceObject: {fileID: 0}
  m_PrefabInstance: {fileID: 0}
  m_PrefabAsset: {fileID: 0}
  m_GameObject: {fileID: 0}
  m_Enabled: 1
  m_EditorHideFlags: 0
  m_Script: {fileID: 11500000, guid: 29e288510afce78478f01d6d3d350be5, type: 3}
  m_Name: ItemItemComb-9
  m_EditorClassIdentifier: 
  object1: {fileID: 11400000, guid: 9d468eabd2c118a4798413760e698e47, type: 2}
  object2: {fileID: 11400000, guid: 532f8d20495fc7f4d89ab4d50dda2c6a, type: 2}
  entryPoint: {fileID: 114897666847600098, guid: c4db45f09aed66e47a224db19e75f4d7,
    type: 2}
  corruptionReport: 
--- !u!114 &114671360962857392
MonoBehaviour:
  m_ObjectHideFlags: 0
  m_CorrespondingSourceObject: {fileID: 0}
  m_PrefabInstance: {fileID: 0}
  m_PrefabAsset: {fileID: 0}
  m_GameObject: {fileID: 0}
  m_Enabled: 1
  m_EditorHideFlags: 0
  m_Script: {fileID: 11500000, guid: 29e288510afce78478f01d6d3d350be5, type: 3}
  m_Name: ItemItemComb-6
  m_EditorClassIdentifier: 
  object1: {fileID: 0}
  object2: {fileID: 0}
  entryPoint: {fileID: 0}
  corruptionReport: 
--- !u!114 &114969408125185110
MonoBehaviour:
  m_ObjectHideFlags: 0
  m_CorrespondingSourceObject: {fileID: 0}
  m_PrefabInstance: {fileID: 0}
  m_PrefabAsset: {fileID: 0}
  m_GameObject: {fileID: 0}
  m_Enabled: 1
  m_EditorHideFlags: 0
  m_Script: {fileID: 11500000, guid: e63fa5d1a1a78b64894de4ff2bdefb6f, type: 3}
  m_Name: ItemCharacterComb-6
  m_EditorClassIdentifier: 
  object1: {fileID: 11400000, guid: 9fe2bfda7b756164cb56b1eb1205e66c, type: 2}
  object2: {fileID: 11400000, guid: 40750ef73972ae04cba5ded745e7aa10, type: 2}
  entryPoint: {fileID: 114417600168352482, guid: 08ba9f158859b854a9ac5852abd26ae4,
    type: 2}
  corruptionReport: 
