%YAML 1.1
%TAG !u! tag:unity3d.com,2011:
--- !u!114 &11400000
MonoBehaviour:
  m_ObjectHideFlags: 0
  m_CorrespondingSourceObject: {fileID: 0}
  m_PrefabInstance: {fileID: 0}
  m_PrefabAsset: {fileID: 0}
  m_GameObject: {fileID: 0}
  m_Enabled: 1
  m_EditorHideFlags: 0
  m_Script: {fileID: 11500000, guid: 33f12a0586d749a4e86f3fca17ab8367, type: 3}
  m_Name: "O104 - Vyp\xEDna\u010D"
  m_EditorClassIdentifier: 
  uniqueId: 104
  editorName: "O104 - Vyp\xEDna\u010D"
  names:
  - cs: "Vyp\xEDna\u010D"
    en: 
  currentNameIndex: 0
  currentDialogEntryPoint: {fileID: 114814475285741742, guid: 37ecefa096dc26b489f74c08d5198b3f,
    type: 2}
  currentExamineEntryPoint: {fileID: 114395941907901726, guid: f758a99b3dbe73443bebf3ddfbafe879,
    type: 2}
  defaultDialogEntryPoint: {fileID: 114814475285741742, guid: 37ecefa096dc26b489f74c08d5198b3f,
    type: 2}
  defaultExamineEntryPoint: {fileID: 114395941907901726, guid: f758a99b3dbe73443bebf3ddfbafe879,
    type: 2}
  visible: 1
  mouseInteractive: 1
  talkative: 1
  defaultVisible: 1
  defaultInteractive: 1
  defaultTalkative: 1
