%YAML 1.1
%TAG !u! tag:unity3d.com,2011:
--- !u!114 &11400000
MonoBehaviour:
  m_ObjectHideFlags: 0
  m_CorrespondingSourceObject: {fileID: 0}
  m_PrefabInstance: {fileID: 0}
  m_PrefabAsset: {fileID: 0}
  m_GameObject: {fileID: 0}
  m_Enabled: 1
  m_EditorHideFlags: 0
  m_Script: {fileID: 11500000, guid: 33f12a0586d749a4e86f3fca17ab8367, type: 3}
  m_Name: P0 - hrac
  m_EditorClassIdentifier: 
  uniqueId: 0
  editorName: character
  names:
  - cs: "J\xE1"
    en: Me
  currentNameIndex: 0
  currentDialogEntryPoint: {fileID: 0}
  currentExamineEntryPoint: {fileID: 0}
  defaultDialogEntryPoint: {fileID: 0}
  defaultExamineEntryPoint: {fileID: 0}
  visible: 1
  mouseInteractive: 1
  talkative: 1
  defaultVisible: 1
  defaultInteractive: 1
  defaultTalkative: 1
