%YAML 1.1
%TAG !u! tag:unity3d.com,2011:
--- !u!114 &11400000
MonoBehaviour:
  m_ObjectHideFlags: 0
  m_CorrespondingSourceObject: {fileID: 0}
  m_PrefabInstance: {fileID: 0}
  m_PrefabAsset: {fileID: 0}
  m_GameObject: {fileID: 0}
  m_Enabled: 1
  m_EditorHideFlags: 0
  m_Script: {fileID: 11500000, guid: 9c285848f21a0f442a2a70504a95c050, type: 3}
  m_Name: I1 - Figurka slona
  m_EditorClassIdentifier: 
  uniqueId: 1
  editorName: I1 - Figurka slona
  names:
  - cs: Figurka slona
    en: 
  currentNameIndex: 0
  currentExamineEntryPoint: {fileID: 114076126871831234, guid: 1adf79c71c1db71478d122c8db93ea32,
    type: 2}
  icon: {fileID: 21300000, guid: ab5947b3555d59d4ca239239265942b5, type: 3}
