%YAML 1.1
%TAG !u! tag:unity3d.com,2011:
--- !u!114 &11400000
MonoBehaviour:
  m_ObjectHideFlags: 0
  m_CorrespondingSourceObject: {fileID: 0}
  m_PrefabInstance: {fileID: 0}
  m_PrefabAsset: {fileID: 0}
  m_GameObject: {fileID: 0}
  m_Enabled: 1
  m_EditorHideFlags: 0
  m_Script: {fileID: 11500000, guid: 33f12a0586d749a4e86f3fca17ab8367, type: 3}
  m_Name: "O106 - Sada l\xED\u010Didel"
  m_EditorClassIdentifier: 
  uniqueId: 106
  editorName: "O106 - Sada l\xED\u010Didel"
  names:
  - cs: "Sada l\xED\u010Didel"
    en: 
  currentNameIndex: 0
  currentDialogEntryPoint: {fileID: 114620505309992188, guid: 5a9a26bc916d27643b6413682b70d9ad,
    type: 2}
  currentExamineEntryPoint: {fileID: 114620505309992188, guid: 5a9a26bc916d27643b6413682b70d9ad,
    type: 2}
  defaultDialogEntryPoint: {fileID: 114620505309992188, guid: 5a9a26bc916d27643b6413682b70d9ad,
    type: 2}
  defaultExamineEntryPoint: {fileID: 114620505309992188, guid: 5a9a26bc916d27643b6413682b70d9ad,
    type: 2}
  visible: 1
  mouseInteractive: 0
  talkative: 0
  defaultVisible: 1
  defaultInteractive: 0
  defaultTalkative: 0
