%YAML 1.1
%TAG !u! tag:unity3d.com,2011:
--- !u!114 &11400000
MonoBehaviour:
  m_ObjectHideFlags: 0
  m_CorrespondingSourceObject: {fileID: 0}
  m_PrefabInstance: {fileID: 0}
  m_PrefabAsset: {fileID: 0}
  m_GameObject: {fileID: 0}
  m_Enabled: 1
  m_EditorHideFlags: 0
  m_Script: {fileID: 11500000, guid: 33f12a0586d749a4e86f3fca17ab8367, type: 3}
  m_Name: "O117 - Sk\u0159\xED\u0148ka s l\xED\u010Didly"
  m_EditorClassIdentifier: 
  uniqueId: 117
  editorName: "O117 - Sk\u0159\xED\u0148ka s l\xED\u010Didly"
  names:
  - cs: "Sk\u0159\xED\u0148ka s l\xED\u010Didly"
    en: 
  currentNameIndex: 0
  currentDialogEntryPoint: {fileID: 114088138085059534, guid: a2c88d5777e468f439385a6fa1af8f57,
    type: 2}
  currentExamineEntryPoint: {fileID: 114274833884182138, guid: 188e938d418d7174ea6daa4432de52c5,
    type: 2}
  defaultDialogEntryPoint: {fileID: 114718715743710084, guid: a2c88d5777e468f439385a6fa1af8f57,
    type: 2}
  defaultExamineEntryPoint: {fileID: 114274833884182138, guid: 188e938d418d7174ea6daa4432de52c5,
    type: 2}
  visible: 1
  mouseInteractive: 1
  talkative: 1
  defaultVisible: 1
  defaultInteractive: 1
  defaultTalkative: 1
