%YAML 1.1
%TAG !u! tag:unity3d.com,2011:
--- !u!114 &11400000
MonoBehaviour:
  m_ObjectHideFlags: 0
  m_CorrespondingSourceObject: {fileID: 0}
  m_PrefabInstance: {fileID: 0}
  m_PrefabAsset: {fileID: 0}
  m_GameObject: {fileID: 0}
  m_Enabled: 1
  m_EditorHideFlags: 0
  m_Script: {fileID: 11500000, guid: 33f12a0586d749a4e86f3fca17ab8367, type: 3}
  m_Name: "P1 - Princip\xE1l"
  m_EditorClassIdentifier: 
  uniqueId: 1
  editorName: "P1 - Princip\xE1l"
  names:
  - cs: "Princip\xE1l"
    en: 
  currentNameIndex: 0
  currentDialogEntryPoint: {fileID: 114956507278355756, guid: 9ac4666d65deca34c980b8aefc5a0dca,
    type: 2}
  currentExamineEntryPoint: {fileID: 114384052569785230, guid: 1985e897742d5e344ba82f078fafbe33,
    type: 2}
  defaultDialogEntryPoint: {fileID: 114956507278355756, guid: 9ac4666d65deca34c980b8aefc5a0dca,
    type: 2}
  defaultExamineEntryPoint: {fileID: 114384052569785230, guid: 1985e897742d5e344ba82f078fafbe33,
    type: 2}
  visible: 0
  mouseInteractive: 0
  talkative: 0
  defaultVisible: 0
  defaultInteractive: 0
  defaultTalkative: 0
