%YAML 1.1
%TAG !u! tag:unity3d.com,2011:
--- !u!114 &11400000
MonoBehaviour:
  m_ObjectHideFlags: 0
  m_CorrespondingSourceObject: {fileID: 0}
  m_PrefabInstance: {fileID: 0}
  m_PrefabAsset: {fileID: 0}
  m_GameObject: {fileID: 0}
  m_Enabled: 1
  m_EditorHideFlags: 0
  m_Script: {fileID: 11500000, guid: d9befb3dd6d154349b8cfd04bca5f398, type: 3}
  m_Name: L2 - jelenka
  m_EditorClassIdentifier: 
  uniqueId: 2
  editorName: Jelenka
  names:
  - cs: Jelenka
    en: 
  currentNameIndex: 0
  sceneIndex: 2
  isOpened: 0
  onOpenEntryPoint: {fileID: 0}
  defaultOnOpenEntryPoint: {fileID: 0}
  allPossibleCharactersTransforms:
  - character: {fileID: 11400000, guid: f1ac703ea02cd25498f98237aeb719ac, type: 2}
    transformsStorage:
      transforms: []
      currentIndex: -1
      corruptionReport: 
  allPossibleCharactersActivities:
  - character: {fileID: 11400000, guid: f1ac703ea02cd25498f98237aeb719ac, type: 2}
    activitiesStorage:
      activities:
      - idle
      - open
      - clos
      currentIndex: 0
      corruptionReport: 
