Library\Bee\artifacts\movedfrom\Unity.TextMeshPro.ref.dll_3347408470021090976.movedfrom
Library\Bee\artifacts\movedfrom\Unity.Timeline.ref.dll_639823423384821306.movedfrom
Library\Bee\artifacts\movedfrom\Unity.VisualScripting.Core.ref.dll_1140816074267794399.movedfrom
Library\Bee\artifacts\movedfrom\Unity.VisualScripting.Flow.ref.dll_6261655512741515406.movedfrom
Library\Bee\artifacts\movedfrom\Unity.VisualScripting.State.ref.dll_12037227072028712263.movedfrom
Library\Bee\artifacts\movedfrom\UnityEngine.UI.ref.dll_12664940582929284107.movedfrom
Library\Bee\artifacts\movedfrom\UnityEngine.AccessibilityModule.dll_12043936614469148499.movedfrom
Library\Bee\artifacts\movedfrom\UnityEngine.AIModule.dll_3353293589731831991.movedfrom
Library\Bee\artifacts\movedfrom\UnityEngine.AndroidJNIModule.dll_15618153165835702773.movedfrom
Library\Bee\artifacts\movedfrom\UnityEngine.AnimationModule.dll_17494731513518715193.movedfrom
Library\Bee\artifacts\movedfrom\UnityEngine.ARModule.dll_16716253252331294592.movedfrom
Library\Bee\artifacts\movedfrom\UnityEngine.AssetBundleModule.dll_18142315917969709447.movedfrom
Library\Bee\artifacts\movedfrom\UnityEngine.AudioModule.dll_17351068490662304747.movedfrom
Library\Bee\artifacts\movedfrom\UnityEngine.ClothModule.dll_6319603435889179343.movedfrom
Library\Bee\artifacts\movedfrom\UnityEngine.CoreModule.dll_9425197609026684910.movedfrom
Library\Bee\artifacts\movedfrom\UnityEngine.CrashReportingModule.dll_16398534247164501062.movedfrom
Library\Bee\artifacts\movedfrom\UnityEngine.DirectorModule.dll_4189253405303595403.movedfrom
Library\Bee\artifacts\movedfrom\UnityEngine.dll_10992751133055868487.movedfrom
Library\Bee\artifacts\movedfrom\UnityEngine.DSPGraphModule.dll_4572447954125206188.movedfrom
Library\Bee\artifacts\movedfrom\UnityEngine.GameCenterModule.dll_219583093781594854.movedfrom
Library\Bee\artifacts\movedfrom\UnityEngine.GIModule.dll_14323016704894851281.movedfrom
Library\Bee\artifacts\movedfrom\UnityEngine.GridModule.dll_6935019199491874277.movedfrom
Library\Bee\artifacts\movedfrom\UnityEngine.HotReloadModule.dll_8363892201386708155.movedfrom
Library\Bee\artifacts\movedfrom\UnityEngine.ImageConversionModule.dll_9049579271562774246.movedfrom
Library\Bee\artifacts\movedfrom\UnityEngine.IMGUIModule.dll_2966465069624848332.movedfrom
Library\Bee\artifacts\movedfrom\UnityEngine.InputLegacyModule.dll_10163374571364913016.movedfrom
Library\Bee\artifacts\movedfrom\UnityEngine.InputModule.dll_6287351141808111759.movedfrom
Library\Bee\artifacts\movedfrom\UnityEngine.JSONSerializeModule.dll_521346383643181021.movedfrom
Library\Bee\artifacts\movedfrom\UnityEngine.LocalizationModule.dll_12481459411588215480.movedfrom
Library\Bee\artifacts\movedfrom\UnityEngine.ParticleSystemModule.dll_3937717620796745684.movedfrom
Library\Bee\artifacts\movedfrom\UnityEngine.PerformanceReportingModule.dll_8520516431237122733.movedfrom
Library\Bee\artifacts\movedfrom\UnityEngine.Physics2DModule.dll_4571071774621067470.movedfrom
Library\Bee\artifacts\movedfrom\UnityEngine.PhysicsModule.dll_17314724635536425500.movedfrom
Library\Bee\artifacts\movedfrom\UnityEngine.ProfilerModule.dll_7811899262233536664.movedfrom
Library\Bee\artifacts\movedfrom\UnityEngine.RuntimeInitializeOnLoadManagerInitializerModule.dll_6985594680918308247.movedfrom
Library\Bee\artifacts\movedfrom\UnityEngine.ScreenCaptureModule.dll_2387997741296430143.movedfrom
Library\Bee\artifacts\movedfrom\UnityEngine.SharedInternalsModule.dll_119291772012249654.movedfrom
Library\Bee\artifacts\movedfrom\UnityEngine.SpriteMaskModule.dll_17021513366955890784.movedfrom
Library\Bee\artifacts\movedfrom\UnityEngine.SpriteShapeModule.dll_1524364635566903697.movedfrom
Library\Bee\artifacts\movedfrom\UnityEngine.StreamingModule.dll_12060273592376830071.movedfrom
Library\Bee\artifacts\movedfrom\UnityEngine.SubstanceModule.dll_9514354733057844869.movedfrom
Library\Bee\artifacts\movedfrom\UnityEngine.SubsystemsModule.dll_6261682002496323699.movedfrom
Library\Bee\artifacts\movedfrom\UnityEngine.TerrainModule.dll_761316971145382666.movedfrom
Library\Bee\artifacts\movedfrom\UnityEngine.TerrainPhysicsModule.dll_3972243192570831457.movedfrom
Library\Bee\artifacts\movedfrom\UnityEngine.TextCoreModule.dll_15194595048882033051.movedfrom
Library\Bee\artifacts\movedfrom\UnityEngine.TextRenderingModule.dll_5360217410733354036.movedfrom
Library\Bee\artifacts\movedfrom\UnityEngine.TilemapModule.dll_12217462327415778323.movedfrom
Library\Bee\artifacts\movedfrom\UnityEngine.TLSModule.dll_16693538956774271984.movedfrom
Library\Bee\artifacts\movedfrom\UnityEngine.UIElementsModule.dll_6567470926561819754.movedfrom
Library\Bee\artifacts\movedfrom\UnityEngine.UIElementsNativeModule.dll_15181489969109603457.movedfrom
Library\Bee\artifacts\movedfrom\UnityEngine.UIModule.dll_3025549159522793059.movedfrom
Library\Bee\artifacts\movedfrom\UnityEngine.UmbraModule.dll_7755212806089934686.movedfrom
Library\Bee\artifacts\movedfrom\UnityEngine.UNETModule.dll_1545666178334358887.movedfrom
Library\Bee\artifacts\movedfrom\UnityEngine.UnityAnalyticsModule.dll_6216381568748501456.movedfrom
Library\Bee\artifacts\movedfrom\UnityEngine.UnityConnectModule.dll_15901455861356178852.movedfrom
Library\Bee\artifacts\movedfrom\UnityEngine.UnityCurlModule.dll_2730983268797211430.movedfrom
Library\Bee\artifacts\movedfrom\UnityEngine.UnityTestProtocolModule.dll_6760515285659224724.movedfrom
Library\Bee\artifacts\movedfrom\UnityEngine.UnityWebRequestAssetBundleModule.dll_17968717723147122849.movedfrom
Library\Bee\artifacts\movedfrom\UnityEngine.UnityWebRequestAudioModule.dll_17166394031084623173.movedfrom
Library\Bee\artifacts\movedfrom\UnityEngine.UnityWebRequestModule.dll_10319321318414180709.movedfrom
Library\Bee\artifacts\movedfrom\UnityEngine.UnityWebRequestTextureModule.dll_9533241105873401274.movedfrom
Library\Bee\artifacts\movedfrom\UnityEngine.UnityWebRequestWWWModule.dll_15434829984265816886.movedfrom
Library\Bee\artifacts\movedfrom\UnityEngine.VehiclesModule.dll_12818987567204610342.movedfrom
Library\Bee\artifacts\movedfrom\UnityEngine.VFXModule.dll_7532821966560580957.movedfrom
Library\Bee\artifacts\movedfrom\UnityEngine.VideoModule.dll_1573134265212237712.movedfrom
Library\Bee\artifacts\movedfrom\UnityEngine.VRModule.dll_8993423971127983067.movedfrom
Library\Bee\artifacts\movedfrom\UnityEngine.WindModule.dll_17950189720967054935.movedfrom
Library\Bee\artifacts\movedfrom\UnityEngine.XRModule.dll_12649998342848989497.movedfrom