%YAML 1.1
%TAG !u! tag:unity3d.com,2011:
--- !u!114 &11400000
MonoBehaviour:
  m_ObjectHideFlags: 0
  m_CorrespondingSourceObject: {fileID: 0}
  m_PrefabInstance: {fileID: 0}
  m_PrefabAsset: {fileID: 0}
  m_GameObject: {fileID: 0}
  m_Enabled: 1
  m_EditorHideFlags: 0
  m_Script: {fileID: 11500000, guid: 1c16ca8d13e151d48bca8dba1ce849d4, type: 3}
  m_Name: DemoAppConfig
  m_EditorClassIdentifier: 
  urlPath: http://data.3dsense.org/ipn-data/demo/
