[
    {
        "id": "31a81341d3023193",
        "type": "group",
        "z": "9a3d13ffa8a0bd19",
        "name": "",
        "style": {
            "label": true,
            "color": "#000000",
            "fill": "#e3f3d3"
        },
        "nodes": [
            "8f9d2d464b832acb",
            "c9ec6dcfe58ea2b4",
            "a677e666bb371e72",
            "927a2bd641ce0388",
            "79605753026424ea",
            "ea9b646ac0d5baae",
            "20f93a9e4e985771",
            "ecaa5cd58fc5eebe",
            "fbecb126f1f16c52",
            "ee4d312a5161cc3b"
        ],
        "x": 34,
        "y": 119,
        "w": 952,
        "h": 242
    },
    {
        "id": "8f9d2d464b832acb",
        "type": "inject",
        "z": "9a3d13ffa8a0bd19",
        "g": "31a81341d3023193",
        "name": "Start flow",
        "props": [],
        "repeat": "300",
        "crontab": "",
        "once": false,
        "onceDelay": "15",
        "topic": "",
        "x": 150,
        "y": 160,
        "wires": [
            [
                "c9ec6dcfe58ea2b4"
            ]
        ]
    },
    {
        "id": "c9ec6dcfe58ea2b4",
        "type": "function",
        "z": "9a3d13ffa8a0bd19",
        "g": "31a81341d3023193",
        "name": "Prepare Element IoT request",
        "func": "let folderId = \"\" // folder Id here\nlet auth = env.get(\"SECRET\")\n\n// url limit set to max\nmsg.url = \"https://element-iot.com/api/v1/tags/\" + folderId + \"/devices?limit=100&last_readings=1&auth=\" + auth\n\nreturn msg;",
        "outputs": 1,
        "timeout": "",
        "noerr": 0,
        "initialize": "",
        "finalize": "",
        "libs": [],
        "x": 320,
        "y": 200,
        "wires": [
            [
                "a677e666bb371e72"
            ]
        ]
    },
    {
        "id": "a677e666bb371e72",
        "type": "http request",
        "z": "9a3d13ffa8a0bd19",
        "g": "31a81341d3023193",
        "name": "GET IoT Readings",
        "method": "GET",
        "ret": "obj",
        "paytoqs": "ignore",
        "url": "",
        "tls": "",
        "persist": false,
        "proxy": "",
        "insecureHTTPParser": false,
        "authType": "",
        "senderr": false,
        "headers": [],
        "x": 650,
        "y": 200,
        "wires": [
            [
                "927a2bd641ce0388",
                "ee4d312a5161cc3b"
            ]
        ]
    },
    {
        "id": "927a2bd641ce0388",
        "type": "debug",
        "z": "9a3d13ffa8a0bd19",
        "g": "31a81341d3023193",
        "name": "",
        "active": true,
        "tosidebar": true,
        "console": false,
        "tostatus": false,
        "complete": "true",
        "targetType": "full",
        "statusVal": "",
        "statusType": "auto",
        "x": 890,
        "y": 200,
        "wires": []
    },
    {
        "id": "79605753026424ea",
        "type": "function",
        "z": "9a3d13ffa8a0bd19",
        "g": "31a81341d3023193",
        "name": "Prepare request for storing data in Orion Context Broker",
        "func": "msg.url = env.get(\"SC_ORION_SERVER\") + \"/v2/op/update\";\n\nmsg.headers = {\n\n    \"Content-Type\": 'application/json',\n    \"Fiware-Service\": env.get(\"FIWARE_SERVICE\")\n};\n\nmsg.payload.actionType = 'append';\n\nreturn msg;",
        "outputs": 1,
        "timeout": "",
        "noerr": 0,
        "initialize": "",
        "finalize": "",
        "libs": [],
        "x": 490,
        "y": 280,
        "wires": [
            [
                "ecaa5cd58fc5eebe",
                "ea9b646ac0d5baae"
            ]
        ]
    },
    {
        "id": "ea9b646ac0d5baae",
        "type": "http request",
        "z": "9a3d13ffa8a0bd19",
        "g": "31a81341d3023193",
        "name": "POST",
        "method": "POST",
        "ret": "txt",
        "paytoqs": "ignore",
        "url": "",
        "tls": "",
        "persist": false,
        "proxy": "",
        "insecureHTTPParser": false,
        "authType": "",
        "senderr": false,
        "headers": [],
        "x": 710,
        "y": 320,
        "wires": [
            [
                "20f93a9e4e985771"
            ]
        ]
    },
    {
        "id": "20f93a9e4e985771",
        "type": "debug",
        "z": "9a3d13ffa8a0bd19",
        "g": "31a81341d3023193",
        "name": "",
        "active": true,
        "tosidebar": true,
        "console": false,
        "tostatus": false,
        "complete": "true",
        "targetType": "full",
        "statusVal": "",
        "statusType": "auto",
        "x": 890,
        "y": 320,
        "wires": []
    },
    {
        "id": "ecaa5cd58fc5eebe",
        "type": "debug",
        "z": "9a3d13ffa8a0bd19",
        "g": "31a81341d3023193",
        "name": "",
        "active": true,
        "tosidebar": true,
        "console": false,
        "tostatus": false,
        "complete": "true",
        "targetType": "full",
        "statusVal": "",
        "statusType": "auto",
        "x": 890,
        "y": 280,
        "wires": []
    },
    {
        "id": "fbecb126f1f16c52",
        "type": "debug",
        "z": "9a3d13ffa8a0bd19",
        "g": "31a81341d3023193",
        "name": "",
        "active": false,
        "tosidebar": true,
        "console": false,
        "tostatus": false,
        "complete": "true",
        "targetType": "full",
        "statusVal": "",
        "statusType": "auto",
        "x": 890,
        "y": 240,
        "wires": []
    },
    {
        "id": "ee4d312a5161cc3b",
        "type": "function",
        "z": "9a3d13ffa8a0bd19",
        "g": "31a81341d3023193",
        "name": "Prepare data for storage",
        "func": "// entities array for all readings\nlet entities = [];\n\n// iterate over payload\nfor(const dataObject of msg.payload.body){\n\n   if ((dataObject.last_readings).length == 0) continue;\n\n   // measurements recorded within last month\n   let measured_at = new Date(dataObject.last_readings[0].measured_at);\n   let last_month = new Date();\n   last_month.setMonth(last_month.getDate() - 1);\n   last_month = last_month.toISOString;\n   if (measured_at < last_month) continue;\n  \n   let dataModel = {\n      id: \"urn:ngsi-ld:AirQualityObserved:\" + dataObject.last_readings[0].device_id,\n      type: \"AirQualityObserved\",\n      name: {\n         type: \"Text\",\n         value: dataObject.name \n      },\n      alternateName: {\n         type: \"Text\",\n         value: dataObject.slug\n      },\n      dateObserved: {\n         type: \"DateTime\",\n         value: measured_at\n      },\n      co2: {\n         type: \"Number\",\n         value: dataObject.last_readings[0].data.co2_1\n      },\n      relativeHumidity: {\n         type: \"Number\",\n         value: dataObject.last_readings[0].data.humidity_1\n      },\n      temperature: {\n         type: \"Number\",\n         value: dataObject.last_readings[0].data.temperature_1\n      }\n   };\n\n   if (dataObject.location){\n      \n      dataModel.location = {\n         type: \"geo:json\",\n         value: dataObject.location\n      }\n   }\n\n   entities.push(dataModel);\n}\n\n// clear msg object\nmsg = {};\nmsg.payload = {};\n\n// create entitiy to post\nmsg.payload.entities = entities;\n\nreturn msg;",
        "outputs": 1,
        "timeout": "",
        "noerr": 0,
        "initialize": "",
        "finalize": "",
        "libs": [],
        "x": 350,
        "y": 240,
        "wires": [
            [
                "fbecb126f1f16c52",
                "79605753026424ea"
            ]
        ]
    }
]