[
    {
        "id": "be81cd24c22e082b",
        "type": "tab",
        "label": "People Counter",
        "disabled": false,
        "info": "",
        "env": []
    },
    {
        "id": "372cd07969f19dc7",
        "type": "group",
        "z": "be81cd24c22e082b",
        "name": "Retrieve \"People Counter\" Data in a foor loop",
        "style": {
            "label": true
        },
        "nodes": [
            "9cf083c06ba62474",
            "fcb793d160532616",
            "24bda70fb4af70a5",
            "f9df1834e8db62f2",
            "708616c2141efbde",
            "2690053e117dabaa",
            "eb5acb00633175db",
            "426b2367287d9ae2",
            "2490000dae9e1dff",
            "a77cbd8962c1affb"
        ],
        "x": 34,
        "y": 99,
        "w": 952,
        "h": 302
    },
    {
        "id": "01631d88afa78e3d",
        "type": "group",
        "z": "be81cd24c22e082b",
        "name": "Create Subscription",
        "style": {
            "fill": "#e3f3d3",
            "label": true,
            "color": "#000000",
            "stroke": "#addb7b"
        },
        "nodes": [
            "0d31e3cfab62e6fb",
            "eb084cf0ebaddeda",
            "ea23bfa8c7ade7ef",
            "70eaeddf224b6b64",
            "3ca4e7a1895a1807",
            "64912246aa8ef0bc",
            "2695d42d33b6c463",
            "642696e117de4b7b",
            "355c42b4767f8c4b"
        ],
        "x": 34,
        "y": 659,
        "w": 1032,
        "h": 202
    },
    {
        "id": "9cf083c06ba62474",
        "type": "inject",
        "z": "be81cd24c22e082b",
        "g": "372cd07969f19dc7",
        "name": "",
        "props": [
            {
                "p": "payload"
            }
        ],
        "repeat": "900",
        "crontab": "",
        "once": true,
        "onceDelay": "15",
        "topic": "",
        "payload": "",
        "payloadType": "date",
        "x": 150,
        "y": 140,
        "wires": [
            [
                "fcb793d160532616"
            ]
        ]
    },
    {
        "id": "fcb793d160532616",
        "type": "function",
        "z": "be81cd24c22e082b",
        "g": "372cd07969f19dc7",
        "name": "Prepare Element IoT request",
        "func": "let folderId = \"env.get(\"FOLDER_ID\")\"\nlet authToken = env.get(\"ELEMENT_IOT_API_KEY\")\n\nmsg.url = \"https://element-iot.com/api/v1/tags/\" + folderId + \"/devices/?last_readings=1&auth=\" + authToken\n\nreturn msg;",
        "outputs": 1,
        "timeout": "",
        "noerr": 0,
        "initialize": "",
        "finalize": "",
        "libs": [],
        "x": 480,
        "y": 140,
        "wires": [
            [
                "24bda70fb4af70a5"
            ]
        ]
    },
    {
        "id": "24bda70fb4af70a5",
        "type": "http request",
        "z": "be81cd24c22e082b",
        "g": "372cd07969f19dc7",
        "name": "GET",
        "method": "GET",
        "ret": "obj",
        "paytoqs": "ignore",
        "url": "",
        "tls": "",
        "persist": false,
        "proxy": "",
        "insecureHTTPParser": false,
        "authType": "",
        "senderr": false,
        "headers": [],
        "x": 690,
        "y": 140,
        "wires": [
            [
                "f9df1834e8db62f2",
                "a77cbd8962c1affb"
            ]
        ]
    },
    {
        "id": "f9df1834e8db62f2",
        "type": "debug",
        "z": "be81cd24c22e082b",
        "g": "372cd07969f19dc7",
        "name": "",
        "active": true,
        "tosidebar": true,
        "console": false,
        "tostatus": false,
        "complete": "true",
        "targetType": "full",
        "statusVal": "",
        "statusType": "auto",
        "x": 890,
        "y": 140,
        "wires": []
    },
    {
        "id": "708616c2141efbde",
        "type": "function",
        "z": "be81cd24c22e082b",
        "g": "372cd07969f19dc7",
        "name": "Prepare request for storing data in Orion Context Broker",
        "func": "msg.url = env.get(\"SC_ORION_SERVER\")+\"/v2/op/update\";\n\nmsg.headers = {};\nmsg.headers['Content-Type'] = 'application/json';\nmsg.headers['Fiware-Service'] = 'env.get(\"FIWARE_SERVICE\")';\n\nmsg.payload = {}\nmsg.payload.entities = msg.ngsiEntities\n\nmsg.payload.actionType = 'append';\n\nreturn msg;",
        "outputs": 1,
        "timeout": "",
        "noerr": 0,
        "initialize": "",
        "finalize": "",
        "libs": [],
        "x": 570,
        "y": 280,
        "wires": [
            [
                "426b2367287d9ae2",
                "2690053e117dabaa"
            ]
        ]
    },
    {
        "id": "2690053e117dabaa",
        "type": "http request",
        "z": "be81cd24c22e082b",
        "g": "372cd07969f19dc7",
        "name": "POST",
        "method": "POST",
        "ret": "txt",
        "paytoqs": "ignore",
        "url": "",
        "tls": "",
        "persist": false,
        "proxy": "",
        "insecureHTTPParser": false,
        "authType": "",
        "senderr": false,
        "headers": [],
        "x": 690,
        "y": 360,
        "wires": [
            [
                "eb5acb00633175db"
            ]
        ]
    },
    {
        "id": "eb5acb00633175db",
        "type": "debug",
        "z": "be81cd24c22e082b",
        "g": "372cd07969f19dc7",
        "name": "",
        "active": true,
        "tosidebar": true,
        "console": false,
        "tostatus": false,
        "complete": "true",
        "targetType": "full",
        "statusVal": "",
        "statusType": "auto",
        "x": 890,
        "y": 360,
        "wires": []
    },
    {
        "id": "426b2367287d9ae2",
        "type": "debug",
        "z": "be81cd24c22e082b",
        "g": "372cd07969f19dc7",
        "name": "",
        "active": true,
        "tosidebar": true,
        "console": false,
        "tostatus": false,
        "complete": "true",
        "targetType": "full",
        "statusVal": "",
        "statusType": "auto",
        "x": 890,
        "y": 280,
        "wires": []
    },
    {
        "id": "2490000dae9e1dff",
        "type": "debug",
        "z": "be81cd24c22e082b",
        "g": "372cd07969f19dc7",
        "name": "",
        "active": true,
        "tosidebar": true,
        "console": false,
        "tostatus": false,
        "complete": "true",
        "targetType": "full",
        "statusVal": "",
        "statusType": "auto",
        "x": 890,
        "y": 220,
        "wires": []
    },
    {
        "id": "a77cbd8962c1affb",
        "type": "function",
        "z": "be81cd24c22e082b",
        "g": "372cd07969f19dc7",
        "name": "Prepare data for storage",
        "func": "const payload = msg.payload.body;\n\nconst dataModels = []\n\nfor (const device of payload) {\n    if (device.last_readings.length == 0){\n        continue;\n    }\n    \n   const data = device.last_readings[0].data\n    \n   const deviceId = device.id;\n   const dateObserved = new Date(device.last_readings[0].measured_at);\n   const dateObservedFrom = new Date(dateObserved.getTime() - (15 * 60 * 1000)); // 15 minute time slot\n   const dateObservedTo = dateObserved;\n   const directionEnum = [\"inbound\", \"outbound\"];\n   const peopleCountInbound = data.counter_a;\n   const peopleCountOutbound = data.counter_b;\n   const totalPeopleCountInbound = data.total_counter_a;\n   const totalPeopleCountOutbound = data.total_counter_b;\n\n   // define baseModel which is identical for both directions\n   const baseModel = {\n      \"id\": \"urn:nsgi-ld:CrowdFlowObserved:\" + deviceId,\n      \"type\": \"CrowdFlowObserved\",\n      \"dateObserved\": {\n         \"type\": \"DateTime\",\n         \"value\": dateObserved.toISOString()\n      },\n      \"dateObservedFrom\": {\n         \"type\": \"DateTime\",\n         \"value\": dateObservedFrom.toISOString()\n      },\n      \"dateObservedTo\": {\n         \"type\": \"DateTime\",\n         \"value\": dateObservedTo.toISOString()\n      },\n      \"name\": {\n         \"type\": \"Text\",\n         \"value\": device.name\n      }\n   };\n\n   // define inbound and outbound models\n   const inboundDataModel = {\n      ...baseModel,\n      \"direction\": {\n         \"type\": \"Text\",\n         \"value\": \"inbound\"\n      },\n      \"peopleCount\": {\n         \"type\": \"Number\",\n         \"value\": peopleCountInbound\n      },\n      \"totalPeopleCount\": {\n         \"type\": \"Number\",\n         \"value\": totalPeopleCountInbound\n      }\n   }\n\n   const outboundDataModel = {\n      ...baseModel,\n      \"direction\": {\n         \"type\": \"Text\",\n         \"value\": \"outbound\"\n      },\n      \"peopleCount\": {\n         \"type\": \"Number\",\n         \"value\": peopleCountOutbound\n      },\n      \"totalPeopleCount\": {\n         \"type\": \"Number\",\n         \"value\": totalPeopleCountOutbound\n      }\n   }\n    \n    // if a device does have a location, add it here\n    if(device.location) {\n        const location = {\n            \"type\": \"geo:json\",\n            \"value\": {\n                \"type\": \"Point\",\n                \"coordinates\": device.location.coordinates\n            }\n        };\n        \n        inboundDataModel.location = location\n        outboundDataModel.location = location\n    }\n    \n    dataModels.push(inboundDataModel)\n    dataModels.push(outboundDataModel)\n\n}\n\nmsg.ngsiEntities = dataModels\n\nreturn msg;",
        "outputs": 1,
        "timeout": "",
        "noerr": 0,
        "initialize": "",
        "finalize": "",
        "libs": [],
        "x": 470,
        "y": 220,
        "wires": [
            [
                "2490000dae9e1dff",
                "708616c2141efbde"
            ]
        ]
    },
    {
        "id": "72e1e6bf03465e90",
        "type": "split",
        "z": "be81cd24c22e082b",
        "name": "",
        "splt": "\\n",
        "spltType": "str",
        "arraySplt": 1,
        "arraySpltType": "len",
        "stream": false,
        "addname": "",
        "x": 270,
        "y": 560,
        "wires": [
            [
                "64912246aa8ef0bc"
            ]
        ]
    },
    {
        "id": "0d31e3cfab62e6fb",
        "type": "http request",
        "z": "be81cd24c22e082b",
        "g": "01631d88afa78e3d",
        "name": "http POST Request",
        "method": "POST",
        "ret": "txt",
        "paytoqs": "ignore",
        "url": "",
        "tls": "",
        "persist": false,
        "proxy": "",
        "insecureHTTPParser": false,
        "authType": "",
        "senderr": false,
        "headers": [],
        "x": 610,
        "y": 820,
        "wires": [
            [
                "ea23bfa8c7ade7ef"
            ]
        ]
    },
    {
        "id": "eb084cf0ebaddeda",
        "type": "inject",
        "z": "be81cd24c22e082b",
        "g": "01631d88afa78e3d",
        "name": "Go!",
        "props": [
            {
                "p": "payload"
            }
        ],
        "repeat": "",
        "crontab": "",
        "once": false,
        "onceDelay": 0.1,
        "topic": "",
        "payload": "[   \"CrowdFlowObserved\"\t]",
        "payloadType": "jsonata",
        "x": 130,
        "y": 700,
        "wires": [
            [
                "72e1e6bf03465e90"
            ]
        ]
    },
    {
        "id": "ea23bfa8c7ade7ef",
        "type": "debug",
        "z": "be81cd24c22e082b",
        "g": "01631d88afa78e3d",
        "name": "",
        "active": true,
        "tosidebar": true,
        "console": false,
        "tostatus": false,
        "complete": "true",
        "targetType": "full",
        "statusVal": "",
        "statusType": "auto",
        "x": 810,
        "y": 820,
        "wires": []
    },
    {
        "id": "70eaeddf224b6b64",
        "type": "function",
        "z": "be81cd24c22e082b",
        "g": "01631d88afa78e3d",
        "name": "Setup Request",
        "func": "msg.url = env.get(\"SC_ORION_SERVER\") + \"/v2/subscriptions\";\n\nmsg.headers = {};\nmsg.headers['Content-Type'] = 'application/json';\nmsg.headers['Fiware-Service'] = \"env.get(\"FIWARE_SERVICE\")\";\n\nmsg.payload = {\n    \"subject\": {\n        \"entities\": [\n            {\n                \"idPattern\": \".*\",\n                \"type\": msg.dataModel,\n            }\n        ]\n    },\n    \"notification\": {\n        \"http\": {\n            \"url\": env.get(\"DM_QL_SERVER\") + \"/v2/notify\"\n        }\n    }\n}\n\nreturn msg;",
        "outputs": 1,
        "timeout": "",
        "noerr": 0,
        "initialize": "",
        "finalize": "",
        "libs": [],
        "x": 400,
        "y": 820,
        "wires": [
            [
                "0d31e3cfab62e6fb"
            ]
        ]
    },
    {
        "id": "3ca4e7a1895a1807",
        "type": "function",
        "z": "be81cd24c22e082b",
        "g": "01631d88afa78e3d",
        "name": "Check if already exists",
        "func": "const len = msg.headers[\"fiware-total-count\"];\n\nfor (let i = 0; i < len; i++) {\n    const type = msg.payload[i].subject.entities[0].type;\n\n    if (type == msg.dataModel){\n        msg.sub_exists = true;\n        node.warn(\"There is already a subscription for this type.\")\n        break;\n    }\n}\n\nreturn msg;",
        "outputs": 1,
        "timeout": "",
        "noerr": 0,
        "initialize": "",
        "finalize": "",
        "libs": [],
        "x": 940,
        "y": 700,
        "wires": [
            [
                "642696e117de4b7b"
            ]
        ]
    },
    {
        "id": "64912246aa8ef0bc",
        "type": "function",
        "z": "be81cd24c22e082b",
        "g": "01631d88afa78e3d",
        "name": "Setup GET Request",
        "func": "msg.url = env.get(\"SC_ORION_SERVER\") + \"/v2/subscriptions/?options=count&limit=1000\";\nmsg.headers = {};\nmsg.headers['Fiware-Service'] = \"env.get(\"FIWARE_SERVICE\")\";\nmsg.dataModel = msg.payload;\nreturn msg;",
        "outputs": 1,
        "timeout": "",
        "noerr": 0,
        "initialize": "",
        "finalize": "",
        "libs": [],
        "x": 420,
        "y": 700,
        "wires": [
            [
                "2695d42d33b6c463"
            ]
        ]
    },
    {
        "id": "2695d42d33b6c463",
        "type": "http request",
        "z": "be81cd24c22e082b",
        "g": "01631d88afa78e3d",
        "name": "http GET Request",
        "method": "GET",
        "ret": "obj",
        "paytoqs": "ignore",
        "url": "",
        "tls": "",
        "persist": false,
        "proxy": "",
        "insecureHTTPParser": false,
        "authType": "",
        "senderr": false,
        "headers": [],
        "x": 690,
        "y": 700,
        "wires": [
            [
                "3ca4e7a1895a1807"
            ]
        ]
    },
    {
        "id": "642696e117de4b7b",
        "type": "switch",
        "z": "be81cd24c22e082b",
        "g": "01631d88afa78e3d",
        "name": "",
        "property": "sub_exists",
        "propertyType": "msg",
        "rules": [
            {
                "t": "true"
            },
            {
                "t": "else"
            }
        ],
        "checkall": "true",
        "repair": false,
        "outputs": 2,
        "x": 370,
        "y": 760,
        "wires": [
            [
                "355c42b4767f8c4b"
            ],
            [
                "70eaeddf224b6b64"
            ]
        ]
    },
    {
        "id": "355c42b4767f8c4b",
        "type": "debug",
        "z": "be81cd24c22e082b",
        "g": "01631d88afa78e3d",
        "name": "debug 60",
        "active": true,
        "tosidebar": true,
        "console": false,
        "tostatus": false,
        "complete": "false",
        "statusVal": "",
        "statusType": "auto",
        "x": 580,
        "y": 760,
        "wires": []
    }
]