{
  "clientId": "{{ default.IDM_CLIENT.MASTERPORTAL }}",
  "name": "",
  "description": "This client was created by ansible.",
  "rootUrl": "https://idm.{{ DOMAIN }}/auth/realms/{{ inv_idm.keycloak.realm_name }}/central",
  "adminUrl": "https://idm.{{ DOMAIN }}/auth/realms/{{ inv_idm.keycloak.realm_name }}/central",
  "baseUrl": "",
  "surrogateAuthRequired": false,
  "enabled": true,
  "alwaysDisplayInConsole": false,
  "clientAuthenticatorType": "client-secret",
  "secret": "93bc556d-7cab-4b8c-be49-e61d944d58e2",
  "redirectUris": [
    "https://localhost/*",
    "https://oauth.geoportal.{{ DOMAIN }}/*",
    "https://geoportal.pre.{{ DOMAIN }}/geoserver/*",
    "https://geoportal.{{ DOMAIN }}/geoserver/*",
    "http://localhost/*",
    "https://geoserver.{{ DOMAIN }}/*",
    "http://localhost/?oidc=success",
    "https://geoportal.{{ DOMAIN }}/authportal/*",
    "https://geoportal.pre.{{ DOMAIN }}/migportal/*",
    "https://oauth.geoportal.pre.{{ DOMAIN }}/*",
    "https://geoportal.pre.{{ DOMAIN }}/*"
  ],
  "webOrigins": [
    "https://oauth.geoportal.{{ DOMAIN }}",
    "null",
    "+",
    "https://geoportal.{{ DOMAIN }}"
  ],
  "notBefore": 0,
  "bearerOnly": false,
  "consentRequired": false,
  "standardFlowEnabled": true,
  "implicitFlowEnabled": true,
  "directAccessGrantsEnabled": true,
  "serviceAccountsEnabled": true,
  "authorizationServicesEnabled": true,
  "publicClient": false,
  "frontchannelLogout": false,
  "protocol": "openid-connect",
  "attributes": {
    "saml.force.post.binding": "false",
    "saml.multivalued.roles": "false",
    "frontchannel.logout.session.required": "false",
    "post.logout.redirect.uris": "+",
    "oauth2.device.authorization.grant.enabled": "false",
    "backchannel.logout.revoke.offline.tokens": "false",
    "saml.server.signature.keyinfo.ext": "false",
    "use.refresh.tokens": "true",
    "oidc.ciba.grant.enabled": "false",
    "backchannel.logout.session.required": "true",
    "client_credentials.use_refresh_token": "false",
    "require.pushed.authorization.requests": "false",
    "saml.client.signature": "false",
    "saml.allow.ecp.flow": "false",
    "saml.assertion.signature": "false",
    "id.token.as.detached.signature": "false",
    "saml.encrypt": "false",
    "saml.server.signature": "false",
    "exclude.session.state.from.auth.response": "false",
    "saml.artifact.binding": "false",
    "saml_force_name_id_format": "false",
    "tls.client.certificate.bound.access.tokens": "false",
    "acr.loa.map": "{}",
    "saml.authnstatement": "false",
    "display.on.consent.screen": "false",
    "token.response.type.bearer.lower-case": "false",
    "saml.onetimeuse.condition": "false"
  },
  "authenticationFlowBindingOverrides": {},
  "fullScopeAllowed": true,
  "nodeReRegistrationTimeout": -1,
  "protocolMappers": [
    {
      "name": "Client ID",
      "protocol": "openid-connect",
      "protocolMapper": "oidc-usersessionmodel-note-mapper",
      "consentRequired": false,
      "config": {
        "user.session.note": "clientId",
        "id.token.claim": "true",
        "access.token.claim": "true",
        "claim.name": "clientId",
        "jsonType.label": "String"
      }
    },
    {
      "name": "Client IP Address",
      "protocol": "openid-connect",
      "protocolMapper": "oidc-usersessionmodel-note-mapper",
      "consentRequired": false,
      "config": {
        "user.session.note": "clientAddress",
        "id.token.claim": "true",
        "access.token.claim": "true",
        "claim.name": "clientAddress",
        "jsonType.label": "String"
      }
    },
    {
      "name": "Role-Group mapping",
      "protocol": "openid-connect",
      "protocolMapper": "oidc-usermodel-client-role-mapper",
      "consentRequired": false,
      "config": {
        "multivalued": "true",
        "userinfo.token.claim": "true",
        "id.token.claim": "true",
        "access.token.claim": "true",
        "claim.name": "groups",
        "usermodel.clientRoleMapping.clientId": "masterportal"
      }
    },
    {
      "name": "Client Host",
      "protocol": "openid-connect",
      "protocolMapper": "oidc-usersessionmodel-note-mapper",
      "consentRequired": false,
      "config": {
        "user.session.note": "clientHost",
        "id.token.claim": "true",
        "access.token.claim": "true",
        "claim.name": "clientHost",
        "jsonType.label": "String"
      }
    },
    {
      "name": "Dataspace Membership",
      "protocol": "openid-connect",
      "protocolMapper": "oidc-group-membership-mapper",
      "consentRequired": false,
      "config": {
        "full.path": "false",
        "id.token.claim": "true",
        "access.token.claim": "true",
        "claim.name": "dataspaces",
        "userinfo.token.claim": "true"
      }
    },
    {
      "name": "Dataspace Mapper",
      "protocol": "openid-connect",
      "protocolMapper": "script-/theme/{{ inv_idm.keycloak.theme }}/login/resources/js/service.js",
      "consentRequired": false,
      "config": {
        "id.token.claim": "true",
        "access.token.claim": "true",
        "claim.name": "dataspaces",
        "userinfo.token.claim": "true"
      }
    }
  ],
  "defaultClientScopes": [
    "web-origins",
    "openid",
    "roles",
    "profile",
    "email"
  ],
  "optionalClientScopes": [
    "address",
    "phone",
    "offline_access",
    "microprofile-jwt"
  ],
  "access": {
    "view": true,
    "configure": true,
    "manage": true
  }
}