[
    {
        "id": "e27e1748.9bc99",
        "type": "tab",
        "label": "OUT: Receive Data",
        "disabled": true,
        "info": ""
    },
    {
        "id": "ec9ece2c.572638",
        "type": "influxdb",
        "hostname": "${SC_INFLUX_SERVER}",
        "port": "${SC_INFLUX_SERVER_PORT}",
        "protocol": "http",
        "database": "${SC_INFLUX_DB}",
        "name": "Influx S1",
        "usetls": false,
        "tls": "6626cca6.8fa8dc"
    },
    {
        "id": "6626cca6.8fa8dc",
        "type": "tls-config",
        "name": "SSL",
        "cert": "",
        "key": "",
        "ca": "",
        "certname": "",
        "keyname": "",
        "caname": "",
        "servername": "",
        "verifyservercert": false
    },
    {
        "id": "6c7dd34.204be2c",
        "type": "http in",
        "z": "e27e1748.9bc99",
        "name": "",
        "url": "/notify",
        "method": "post",
        "upload": false,
        "swaggerDoc": "",
        "x": 110,
        "y": 80,
        "wires": [
            [
                "c1637a1c.2511a",
                "54be7776.15186",
                "fd220476.4ddb7"
            ]
        ]
    },
    {
        "id": "c1637a1c.2511a",
        "type": "http response",
        "z": "e27e1748.9bc99",
        "name": "",
        "statusCode": "201",
        "headers": {},
        "x": 140,
        "y": 140,
        "wires": []
    },
    {
        "id": "54be7776.15186",
        "type": "debug",
        "z": "e27e1748.9bc99",
        "name": "",
        "active": true,
        "tosidebar": true,
        "console": false,
        "tostatus": false,
        "complete": "true",
        "targetType": "full",
        "x": 610,
        "y": 80,
        "wires": []
    },
    {
        "id": "814055d3.b2e9a",
        "type": "influxdb out",
        "z": "e27e1748.9bc99",
        "influxdb": "ec9ece2c.572638",
        "name": "Push to Influx S1",
        "measurement": "",
        "precision": "",
        "retentionPolicy": "",
        "x": 250,
        "y": 520,
        "wires": []
    },
    {
        "id": "b2a0d59d.7cd518",
        "type": "function",
        "z": "e27e1748.9bc99",
        "name": "WeatherObserved",
        "func": "msg.backup_payload=msg.payload;\nvar data = msg.backup_payload.data[0]\nmsg.measurement=data.id\nmsg.payload = {\n    \"temperature\": data.temperature.value,\n    \"relativeHumidity\": data.relativeHumidity.value,\n    \"atmosphericPressure\": data.atmosphericPressure.value,\n    \"windDirection\": data.windDirection.value,\n    \"windSpeed\": data.windSpeed.value\n    // time\n}\nreturn msg;",
        "outputs": 1,
        "noerr": 0,
        "x": 250,
        "y": 300,
        "wires": [
            [
                "94da499.7d32638",
                "814055d3.b2e9a"
            ]
        ]
    },
    {
        "id": "94da499.7d32638",
        "type": "debug",
        "z": "e27e1748.9bc99",
        "name": "",
        "active": true,
        "tosidebar": true,
        "console": false,
        "tostatus": false,
        "complete": "true",
        "targetType": "full",
        "x": 610,
        "y": 300,
        "wires": []
    },
    {
        "id": "fd220476.4ddb7",
        "type": "switch",
        "z": "e27e1748.9bc99",
        "name": "",
        "property": "payload.data[0].type",
        "propertyType": "msg",
        "rules": [
            {
                "t": "eq",
                "v": "WeatherObserved",
                "vt": "str"
            },
            {
                "t": "eq",
                "v": "AirQualityObserved",
                "vt": "str"
            },
            {
                "t": "eq",
                "v": "ArrivalEstimation",
                "vt": "str"
            }
        ],
        "checkall": "true",
        "repair": false,
        "outputs": 3,
        "x": 140,
        "y": 220,
        "wires": [
            [
                "b2a0d59d.7cd518"
            ],
            [
                "846f5a7d.15a18"
            ],
            [
                "69aa3a1b.4d4ea4"
            ]
        ]
    },
    {
        "id": "846f5a7d.15a18",
        "type": "function",
        "z": "e27e1748.9bc99",
        "name": "AirQualityObserved",
        "func": "msg.backup_payload=msg.payload;\nvar data = msg.backup_payload.data[0]\nmsg.measurement = data.id;\nvar newPayload = {};\nfor (var attr in data) {\n    if (attr == \"id\") {continue;} \n    if (attr == \"type\") {continue;} \n    if (attr == \"location\") {\n        newPayload['lat'] = data[attr].value.coordinates[0];\n        newPayload['lon'] = data[attr].value.coordinates[1];\n        continue;\n    } \n    if (attr == \"PM2.5\") {\n        newPayload[\"PM2_5\"] = data[attr].value;\n    } else {\n        newPayload[attr] = data[attr].value;    \n    }\n    if (attr == \"dateObserved\") { msg.time = Date.parse(data[attr].value);}\n}\nmsg.payload = newPayload;\nreturn msg;\n",
        "outputs": 1,
        "noerr": 0,
        "x": 250,
        "y": 360,
        "wires": [
            [
                "ff13cf9a.a11c48",
                "814055d3.b2e9a"
            ]
        ]
    },
    {
        "id": "ff13cf9a.a11c48",
        "type": "debug",
        "z": "e27e1748.9bc99",
        "name": "",
        "active": true,
        "tosidebar": true,
        "console": false,
        "tostatus": false,
        "complete": "true",
        "targetType": "full",
        "x": 610,
        "y": 360,
        "wires": []
    },
    {
        "id": "69aa3a1b.4d4ea4",
        "type": "function",
        "z": "e27e1748.9bc99",
        "name": "ArrivalEstimation",
        "func": "\nreturn msg;",
        "outputs": 1,
        "noerr": 0,
        "x": 250,
        "y": 420,
        "wires": [
            [
                "8bf3f8c2.05b44",
                "814055d3.b2e9a"
            ]
        ]
    },
    {
        "id": "8bf3f8c2.05b44",
        "type": "debug",
        "z": "e27e1748.9bc99",
        "name": "",
        "active": true,
        "tosidebar": true,
        "console": false,
        "tostatus": false,
        "complete": "true",
        "targetType": "full",
        "x": 610,
        "y": 420,
        "wires": []
    }
]