{
    "dy":{
        "0":1.0,
        "1":2.0,
        "2":3.0,
        "3":1.0,
        "4":2.0,
        "5":3.0,
        "6":1.0,
        "7":2.0,
        "8":3.0
    },
    "tds1__n__iter__":{
        "0":1.0,
        "1":2.0,
        "2":3.0,
        "3":4.0,
        "4":5.0,
        "5":6.0,
        "6":7.0,
        "7":8.0,
        "8":9.0
    },
    "theta":{
        "0":11.0,
        "1":21.0,
        "2":31.0,
        "3":12.0,
        "4":22.0,
        "5":32.0,
        "6":13.0,
        "7":23.0,
        "8":33.0
    },
    "x":{
        "0":1.0,
        "1":1.0,
        "2":1.0,
        "3":2.0,
        "4":2.0,
        "5":2.0,
        "6":3.0,
        "7":3.0,
        "8":3.0
    },
    "z":{
        "0":11.0,
        "1":12.0,
        "2":13.0,
        "3":21.0,
        "4":22.0,
        "5":23.0,
        "6":31.0,
        "7":32.0,
        "8":33.0
    }
}