{
  "_typename" : "TMatrixT<double>",
  "fUniqueID" : 0,
  "fBits" : 0,
  "fNrows" : 8,
  "fNcols" : 8,
  "fRowLwb" : 0,
  "fColLwb" : 0,
  "fNelems" : 64,
  "fNrowIndex" : 0,
  "fTol" : 2.22044604925031e-16,
  "fElements" : [1, 0.448753254847985, 0.289391031626683, -0.0572676044670189, 0.362694238052058, 0.256886866963348, -0.216686773752202, -0.29478273853259, 0.448753254847985, 1, 0.0202192580389592, -0.254683173093779, 0.376393412944634, -0.199582570067765, -0.442453714138203, 0.19823588126781, 0.289391031626683, 0.0202192580389592, 1, 0.498222778221863, -0.207802479190695, -0.287990845480188, 0.00426801345870466, -0.0016612375440019, -0.0572676044670189, -0.254683173093779, 0.498222778221863, 1, -0.919850290152261, 0.100369457844932, 0.141241167611005, 0.194282303740638, 0.362694238052058, 0.376393412944634, -0.207802479190695, -0.919850290152261, 1, -0.13616960951257, -0.111040569399528, -0.313137129654949, 0.256886866963348, -0.199582570067765, -0.287990845480188, 0.100369457844932, -0.13616960951257, 1, -0.194306806850765, 0.284831925184528, -0.216686773752202, -0.442453714138203, 0.00426801345870466, 0.141241167611005, -0.111040569399528, -0.194306806850765, 1, -0.441497820954722, -0.29478273853259, 0.19823588126781, -0.0016612375440019, 0.194282303740638, -0.313137129654949, 0.284831925184528, -0.441497820954722, 1]
}