{
    "title": "event for convergence diagnostics = (Last_epais_bas<0.25)",
    "outputs": {
        "out_temperat": {"last": true, "mean": false},
        "out_qvapeau": {"last": true, "mean": true}
    }
}
