{
    "Inp":{
        "0":"rw",
        "1":"rw",
        "2":"rw",
        "3":"rw",
        "4":"rw",
        "5":"rw",
        "6":"rw",
        "7":"rw",
        "8":"r",
        "9":"r",
        "10":"r",
        "11":"r",
        "12":"r",
        "13":"r",
        "14":"r",
        "15":"r",
        "16":"tu",
        "17":"tu",
        "18":"tu",
        "19":"tu",
        "20":"tu",
        "21":"tu",
        "22":"tu",
        "23":"tu",
        "24":"tl",
        "25":"tl",
        "26":"tl",
        "27":"tl",
        "28":"tl",
        "29":"tl",
        "30":"tl",
        "31":"tl",
        "32":"hu",
        "33":"hu",
        "34":"hu",
        "35":"hu",
        "36":"hu",
        "37":"hu",
        "38":"hu",
        "39":"hu",
        "40":"hl",
        "41":"hl",
        "42":"hl",
        "43":"hl",
        "44":"hl",
        "45":"hl",
        "46":"hl",
        "47":"hl",
        "48":"l",
        "49":"l",
        "50":"l",
        "51":"l",
        "52":"l",
        "53":"l",
        "54":"l",
        "55":"l",
        "56":"kw",
        "57":"kw",
        "58":"kw",
        "59":"kw",
        "60":"kw",
        "61":"kw",
        "62":"kw",
        "63":"kw",
        "64":"__sum__",
        "65":"__sum__"
    },
    "Order":{
        "0":"First",
        "1":"First",
        "2":"First",
        "3":"First",
        "4":"Total",
        "5":"Total",
        "6":"Total",
        "7":"Total",
        "8":"First",
        "9":"First",
        "10":"First",
        "11":"First",
        "12":"Total",
        "13":"Total",
        "14":"Total",
        "15":"Total",
        "16":"First",
        "17":"First",
        "18":"First",
        "19":"First",
        "20":"Total",
        "21":"Total",
        "22":"Total",
        "23":"Total",
        "24":"First",
        "25":"First",
        "26":"First",
        "27":"First",
        "28":"Total",
        "29":"Total",
        "30":"Total",
        "31":"Total",
        "32":"First",
        "33":"First",
        "34":"First",
        "35":"First",
        "36":"Total",
        "37":"Total",
        "38":"Total",
        "39":"Total",
        "40":"First",
        "41":"First",
        "42":"First",
        "43":"First",
        "44":"Total",
        "45":"Total",
        "46":"Total",
        "47":"Total",
        "48":"First",
        "49":"First",
        "50":"First",
        "51":"First",
        "52":"Total",
        "53":"Total",
        "54":"Total",
        "55":"Total",
        "56":"First",
        "57":"First",
        "58":"First",
        "59":"First",
        "60":"Total",
        "61":"Total",
        "62":"Total",
        "63":"Total",
        "64":"First",
        "65":"Total"
    },
    "Value":{
        "0":0.8300331113,
        "1":0.8275506831,
        "2":0.8249770166,
        "3":0.8300331113,
        "4":0.8657619616,
        "5":0.866845792,
        "6":0.8665975137,
        "7":0.8657619616,
        "8":0.0,
        "9":-0.0000294484,
        "10":-0.0026614987,
        "11":0.0,
        "12":0.0001022119,
        "13":0.00408611,
        "14":0.0021081856,
        "15":0.0001022119,
        "16":0.0,
        "17":0.0000000831,
        "18":-0.0026320481,
        "19":0.0,
        "20":0.0001,
        "21":0.004042745,
        "22":0.0020648137,
        "23":0.0001,
        "24":0.0,
        "25":-0.0000173001,
        "26":-0.0026491292,
        "27":0.0,
        "28":0.0001107564,
        "29":0.0042016548,
        "30":0.002223746,
        "31":0.0001107564,
        "32":0.0417297766,
        "33":0.0438869999,
        "34":0.0412896759,
        "35":0.0417297766,
        "36":0.0554921652,
        "37":0.0676620802,
        "38":0.0657807056,
        "39":0.0554921652,
        "40":0.0367345237,
        "41":0.0393524561,
        "42":0.0367164669,
        "43":0.0367345237,
        "44":0.0526187863,
        "45":0.0542932998,
        "46":0.0524231184,
        "47":0.0526187863,
        "48":0.0384214476,
        "49":0.0410460067,
        "50":0.0384177531,
        "51":0.0384214476,
        "52":0.0535727864,
        "53":0.055104276,
        "54":0.0532280655,
        "55":0.0535727864,
        "56":0.006698306,
        "57":0.0093069283,
        "58":0.0066615852,
        "59":0.006698306,
        "60":0.0132315817,
        "61":0.0156590046,
        "62":0.0137183075,
        "63":0.0132315817,
        "64":0.9536171651,
        "65":1.0409902497
    }
}
