{
    "foo__n__iter__":{
        "0":0.0,
        "1":1.0,
        "2":2.0,
        "3":3.0,
        "4":4.0,
        "5":5.0,
        "6":6.0,
        "7":7.0,
        "8":8.0,
        "9":9.0,
        "10":10.0,
        "11":11.0,
        "12":12.0,
        "13":13.0,
        "14":14.0
    },
    "hl":{
        "0":779.8338363543,
        "1":707.2156003807,
        "2":752.9406902958,
        "3":819.278838465,
        "4":710.3470668383,
        "5":797.3482510354,
        "6":722.5438509975,
        "7":794.3284150474,
        "8":767.7009213138,
        "9":726.0556900874,
        "10":742.3582665566,
        "11":809.5969311092,
        "12":763.8474512305,
        "13":782.9499769118,
        "14":734.3382416572
    },
    "hu":{
        "0":990.9044959117,
        "1":1101.533439029,
        "2":1056.2898409422,
        "3":1051.6594592538,
        "4":1003.1115004756,
        "5":1031.6454960983,
        "6":1039.4939379357,
        "7":1027.0976341218,
        "8":1072.7184492368,
        "9":1020.4798133466,
        "10":1006.2727759872,
        "11":1108.509925954,
        "12":1069.4127719551,
        "13":1079.1409173384,
        "14":1090.6278704666
    },
    "incd":{
        "0":3589.983,
        "1":6598.576,
        "2":331.5821,
        "3":2432.158,
        "4":5758.004,
        "5":1085.815,
        "6":2363.463,
        "7":1117.39,
        "8":522.4137,
        "9":2803.544,
        "10":2677.136,
        "11":4992.328,
        "12":415.7096,
        "13":1017.895,
        "14":2923.385
    },
    "kw":{
        "0":11220.4719495224,
        "1":11493.5663915114,
        "2":11967.4280553088,
        "3":11031.1280837753,
        "4":10484.1075114501,
        "5":11638.2477016859,
        "6":10996.748441638,
        "7":11845.9807227752,
        "8":10152.4671484851,
        "9":10380.8379383823,
        "10":10743.9353059777,
        "11":10620.4954781542,
        "12":9951.0815356197,
        "13":10076.312074251,
        "14":11442.9735973203
    },
    "l":{
        "0":1474.3791175981,
        "1":1422.7167882572,
        "2":1184.6375845745,
        "3":1587.4096319775,
        "4":1327.5711942365,
        "5":1265.5037799031,
        "6":1514.3091930511,
        "7":1555.4051767724,
        "8":1304.1418770154,
        "9":1640.2953443391,
        "10":1123.9435852841,
        "11":1199.0227599752,
        "12":1345.2532464204,
        "13":1416.6178825349,
        "14":1644.2940620321
    },
    "rw":{
        "0":0.1495523725,
        "1":0.1394775879,
        "2":0.0557502928,
        "3":0.0836043271,
        "4":0.0586977553,
        "5":0.1203596475,
        "6":0.131956669,
        "7":0.105991947,
        "8":0.0784780902,
        "9":0.0697163973,
        "10":0.1252494128,
        "11":0.116527271,
        "12":0.099262881,
        "13":0.0718681918,
        "14":0.0902134458
    },
    "tl":{
        "0":73.820336895,
        "1":95.1504112991,
        "2":84.8093287208,
        "3":103.1769947855,
        "4":72.1613191588,
        "5":65.2629972733,
        "6":93.3785126594,
        "7":112.8754693351,
        "8":105.7964604101,
        "9":82.5440943153,
        "10":100.6518024723,
        "11":69.0838898679,
        "12":112.1201218,
        "13":90.5803126979,
        "14":80.2443395316
    },
    "tu":{
        "0":111789.6049688593,
        "1":104139.90577348,
        "2":95387.4763222057,
        "3":74144.2542426893,
        "4":65396.6159397811,
        "5":92149.0588885057,
        "6":67464.5409840625,
        "7":80448.721154673,
        "8":100260.4101562388,
        "9":105157.5997713958,
        "10":89522.5725117563,
        "11":73139.3119482063,
        "12":86004.7045932901,
        "13":113774.893076391,
        "14":83779.5684114788
    },
    "yhat":{
        "0":112.0161,
        "1":193.6242,
        "2":29.88087,
        "3":35.40015,
        "4":24.99014,
        "5":97.38609,
        "6":125.3378,
        "7":62.40337,
        "8":45.86766,
        "9":28.41245,
        "10":123.7084,
        "11":112.2766,
        "12":69.80819,
        "13":34.13495,
        "14":63.23662
    }
}