{
    "WrongComputations__n__iter__":{
        "0":4.0,
        "1":5.0,
        "2":8.0,
        "3":12.0,
        "4":23.0
    },
    "hl":{
        "0":751.43,
        "1":785.71,
        "2":751.43,
        "3":751.43,
        "4":785.71
    },
    "hu":{
        "0":1075.71,
        "1":1058.57,
        "2":1075.71,
        "3":1075.71,
        "4":1041.43
    },
    "kw":{
        "0":11106.43,
        "1":12045.0,
        "2":10793.57,
        "3":11419.29,
        "4":12045.0
    },
    "l":{
        "0":1600.0,
        "1":1680.0,
        "2":1520.0,
        "3":1120.0,
        "4":1680.0
    },
    "r":{
        "0":100.0,
        "1":16733.33,
        "2":100.0,
        "3":16733.33,
        "4":16733.33
    },
    "rw":{
        "0":0.0633,
        "1":0.0633,
        "2":0.0767,
        "3":0.09,
        "4":0.1233
    },
    "tl":{
        "0":80.73,
        "1":80.73,
        "2":80.73,
        "3":116.0,
        "4":63.1
    },
    "tu":{
        "0":115600.0,
        "1":80580.0,
        "2":115600.0,
        "3":63070.0,
        "4":63070.0
    },
    "ystar":{
        "0":28.33,
        "1":24.6,
        "2":42.44,
        "3":83.77,
        "4":86.73
    }
}