[MJCONSORT] 2021-03-21 22:23 36 - BinaryLogReader - Found DeleteEvent on log_pos:35819719 TABLE:hospital
[MJCONSORT] 2021-03-21 22:26 08 - BinaryLogReader - Found WriteEvent on log_pos:35820671 TABLE:hospital
[MJCONSORT] 2021-03-21 22:26 11 - BinaryLogReader - Found WriteEvent on log_pos:35821162 TABLE:devices
[MJCONSORT] 2021-03-21 22:26 19 - BinaryLogReader - Found WriteEvent on log_pos:35822668 TABLE:user
[MJCONSORT] 2021-03-21 22:26 26 - BinaryLogReader - Found WriteEvent on log_pos:35824076 TABLE:patients
[MJCONSORT] 2021-03-21 22:26 26 - BinaryLogReader - Found WriteEvent on log_pos:35825464 TABLE:patients
[MJCONSORT] 2021-03-21 22:26 26 - BinaryLogReader - Found WriteEvent on log_pos:35826846 TABLE:patients
[MJCONSORT] 2021-03-21 22:26 26 - BinaryLogReader - Found WriteEvent on log_pos:35828244 TABLE:patients
[MJCONSORT] 2021-03-21 22:26 26 - BinaryLogReader - Found WriteEvent on log_pos:35829628 TABLE:patients
[MJCONSORT] 2021-03-21 22:26 26 - BinaryLogReader - Found WriteEvent on log_pos:35831064 TABLE:patients
[MJCONSORT] 2021-03-21 22:26 26 - BinaryLogReader - Found WriteEvent on log_pos:35832452 TABLE:patients
[MJCONSORT] 2021-03-21 22:26 26 - BinaryLogReader - Found WriteEvent on log_pos:35833870 TABLE:patients
[MJCONSORT] 2021-03-21 22:26 27 - BinaryLogReader - Found WriteEvent on log_pos:35835266 TABLE:patients
[MJCONSORT] 2021-03-21 22:26 27 - BinaryLogReader - Found WriteEvent on log_pos:35836650 TABLE:patients
[MJCONSORT] 2021-03-21 22:26 27 - BinaryLogReader - Found WriteEvent on log_pos:35838088 TABLE:patients
[MJCONSORT] 2021-03-21 22:26 27 - BinaryLogReader - Found WriteEvent on log_pos:35839522 TABLE:patients
[MJCONSORT] 2021-03-21 22:26 27 - BinaryLogReader - Found WriteEvent on log_pos:35840930 TABLE:patients
[MJCONSORT] 2021-03-21 22:26 27 - BinaryLogReader - Found WriteEvent on log_pos:35842378 TABLE:patients
[MJCONSORT] 2021-03-21 22:26 27 - BinaryLogReader - Found WriteEvent on log_pos:35843790 TABLE:patients
[MJCONSORT] 2021-03-21 22:26 27 - BinaryLogReader - Found WriteEvent on log_pos:35845198 TABLE:patients
[MJCONSORT] 2021-03-21 22:26 28 - BinaryLogReader - Found WriteEvent on log_pos:35846632 TABLE:patients
[MJCONSORT] 2021-03-21 22:26 28 - BinaryLogReader - Found WriteEvent on log_pos:35848032 TABLE:patients
[MJCONSORT] 2021-03-21 22:26 28 - BinaryLogReader - Found WriteEvent on log_pos:35849444 TABLE:patients
[MJCONSORT] 2021-03-21 22:26 28 - BinaryLogReader - Found WriteEvent on log_pos:35850818 TABLE:patients
[MJCONSORT] 2021-03-21 22:26 29 - BinaryLogReader - Found WriteEvent on log_pos:35852234 TABLE:patients
[MJCONSORT] 2021-03-21 22:26 29 - BinaryLogReader - Found WriteEvent on log_pos:35853650 TABLE:patients
[MJCONSORT] 2021-03-21 22:26 29 - BinaryLogReader - Found WriteEvent on log_pos:35855054 TABLE:patients
[MJCONSORT] 2021-03-21 22:26 29 - BinaryLogReader - Found WriteEvent on log_pos:35856482 TABLE:patients
[MJCONSORT] 2021-03-21 22:26 29 - BinaryLogReader - Found WriteEvent on log_pos:35857908 TABLE:patients
[MJCONSORT] 2021-03-21 22:26 29 - BinaryLogReader - Found WriteEvent on log_pos:35859306 TABLE:patients
[MJCONSORT] 2021-03-21 22:26 29 - BinaryLogReader - Found WriteEvent on log_pos:35860790 TABLE:patients
[MJCONSORT] 2021-03-21 22:26 29 - BinaryLogReader - Found WriteEvent on log_pos:35862204 TABLE:patients
[MJCONSORT] 2021-03-21 22:26 29 - BinaryLogReader - Found WriteEvent on log_pos:35863652 TABLE:patients
[MJCONSORT] 2021-03-21 22:26 30 - BinaryLogReader - Found WriteEvent on log_pos:35865022 TABLE:patients
[MJCONSORT] 2021-03-21 22:26 30 - BinaryLogReader - Found WriteEvent on log_pos:35866388 TABLE:patients
[MJCONSORT] 2021-03-21 22:26 30 - BinaryLogReader - Found WriteEvent on log_pos:35867822 TABLE:patients
[MJCONSORT] 2021-03-21 22:26 30 - BinaryLogReader - Found WriteEvent on log_pos:35869176 TABLE:patients
[MJCONSORT] 2021-03-21 22:26 30 - BinaryLogReader - Found WriteEvent on log_pos:35870586 TABLE:patients
[MJCONSORT] 2021-03-21 22:26 30 - BinaryLogReader - Found WriteEvent on log_pos:35871976 TABLE:patients
[MJCONSORT] 2021-03-21 22:26 30 - BinaryLogReader - Found WriteEvent on log_pos:35873358 TABLE:patients
[MJCONSORT] 2021-03-21 22:26 30 - BinaryLogReader - Found WriteEvent on log_pos:35874766 TABLE:patients
[MJCONSORT] 2021-03-21 22:26 30 - BinaryLogReader - Found WriteEvent on log_pos:35876176 TABLE:patients
[MJCONSORT] 2021-03-21 22:26 30 - BinaryLogReader - Found WriteEvent on log_pos:35877598 TABLE:patients
[MJCONSORT] 2021-03-21 22:26 31 - BinaryLogReader - Found WriteEvent on log_pos:35879038 TABLE:patients
[MJCONSORT] 2021-03-21 22:26 31 - BinaryLogReader - Found WriteEvent on log_pos:35880460 TABLE:patients
[MJCONSORT] 2021-03-21 22:26 31 - BinaryLogReader - Found WriteEvent on log_pos:35881852 TABLE:patients
[MJCONSORT] 2021-03-21 22:26 31 - BinaryLogReader - Found WriteEvent on log_pos:35883240 TABLE:patients
[MJCONSORT] 2021-03-21 22:26 32 - BinaryLogReader - Found WriteEvent on log_pos:35884648 TABLE:patients
[MJCONSORT] 2021-03-21 22:26 32 - BinaryLogReader - Found WriteEvent on log_pos:35886040 TABLE:patients
[MJCONSORT] 2021-03-21 22:26 32 - BinaryLogReader - Found WriteEvent on log_pos:35887460 TABLE:patients
[MJCONSORT] 2021-03-21 22:26 32 - BinaryLogReader - Found WriteEvent on log_pos:35888866 TABLE:patients
[MJCONSORT] 2021-03-21 22:26 32 - BinaryLogReader - Found WriteEvent on log_pos:35890272 TABLE:patients
[MJCONSORT] 2021-03-21 22:26 32 - BinaryLogReader - Found WriteEvent on log_pos:35891714 TABLE:patients
[MJCONSORT] 2021-03-21 22:26 32 - BinaryLogReader - Found WriteEvent on log_pos:35893124 TABLE:patients
[MJCONSORT] 2021-03-21 22:26 32 - BinaryLogReader - Found WriteEvent on log_pos:35894594 TABLE:patients
[MJCONSORT] 2021-03-21 22:26 33 - BinaryLogReader - Found WriteEvent on log_pos:35895980 TABLE:patients
[MJCONSORT] 2021-03-21 22:26 33 - BinaryLogReader - Found WriteEvent on log_pos:35897400 TABLE:patients
[MJCONSORT] 2021-03-21 22:26 33 - BinaryLogReader - Found WriteEvent on log_pos:35898776 TABLE:patients
[MJCONSORT] 2021-03-21 22:26 33 - BinaryLogReader - Found WriteEvent on log_pos:35900172 TABLE:patients
[MJCONSORT] 2021-03-21 22:26 33 - BinaryLogReader - Found WriteEvent on log_pos:35901556 TABLE:patients
[MJCONSORT] 2021-03-21 22:26 33 - BinaryLogReader - Found WriteEvent on log_pos:35902922 TABLE:patients
[MJCONSORT] 2021-03-21 22:26 33 - BinaryLogReader - Found WriteEvent on log_pos:35904326 TABLE:patients
[MJCONSORT] 2021-03-21 22:26 33 - BinaryLogReader - Found WriteEvent on log_pos:35905766 TABLE:patients
[MJCONSORT] 2021-03-21 22:26 33 - BinaryLogReader - Found WriteEvent on log_pos:35907130 TABLE:patients
[MJCONSORT] 2021-03-21 22:26 34 - BinaryLogReader - Found WriteEvent on log_pos:35908554 TABLE:patients
[MJCONSORT] 2021-03-21 22:26 34 - BinaryLogReader - Found WriteEvent on log_pos:35909946 TABLE:patients
[MJCONSORT] 2021-03-21 22:26 34 - BinaryLogReader - Found WriteEvent on log_pos:35911324 TABLE:patients
[MJCONSORT] 2021-03-21 22:26 34 - BinaryLogReader - Found WriteEvent on log_pos:35912684 TABLE:patients
[MJCONSORT] 2021-03-21 22:26 34 - BinaryLogReader - Found WriteEvent on log_pos:35914110 TABLE:patients
[MJCONSORT] 2021-03-21 22:26 34 - BinaryLogReader - Found WriteEvent on log_pos:35915550 TABLE:patients
[MJCONSORT] 2021-03-21 22:26 34 - BinaryLogReader - Found WriteEvent on log_pos:35916960 TABLE:patients
[MJCONSORT] 2021-03-21 22:26 34 - BinaryLogReader - Found WriteEvent on log_pos:35918402 TABLE:patients
[MJCONSORT] 2021-03-21 22:26 34 - BinaryLogReader - Found WriteEvent on log_pos:35919798 TABLE:patients
[MJCONSORT] 2021-03-21 22:26 34 - BinaryLogReader - Found WriteEvent on log_pos:35921178 TABLE:patients
[MJCONSORT] 2021-03-21 22:26 34 - BinaryLogReader - Found WriteEvent on log_pos:35922572 TABLE:patients
[MJCONSORT] 2021-03-21 22:26 34 - BinaryLogReader - Found WriteEvent on log_pos:35923960 TABLE:patients
[MJCONSORT] 2021-03-21 22:26 35 - BinaryLogReader - Found WriteEvent on log_pos:35925370 TABLE:patients
[MJCONSORT] 2021-03-21 22:26 35 - BinaryLogReader - Found WriteEvent on log_pos:35926766 TABLE:patients
[MJCONSORT] 2021-03-21 22:26 35 - BinaryLogReader - Found WriteEvent on log_pos:35928190 TABLE:patients
[MJCONSORT] 2021-03-21 22:26 35 - BinaryLogReader - Found WriteEvent on log_pos:35929564 TABLE:patients
[MJCONSORT] 2021-03-21 22:26 35 - BinaryLogReader - Found WriteEvent on log_pos:35930908 TABLE:patients
[MJCONSORT] 2021-03-21 22:26 35 - BinaryLogReader - Found WriteEvent on log_pos:35932282 TABLE:patients
[MJCONSORT] 2021-03-21 22:26 36 - BinaryLogReader - Found WriteEvent on log_pos:35933678 TABLE:patients
[MJCONSORT] 2021-03-21 22:26 36 - BinaryLogReader - Found WriteEvent on log_pos:35935110 TABLE:patients
[MJCONSORT] 2021-03-21 22:26 36 - BinaryLogReader - Found WriteEvent on log_pos:35936504 TABLE:patients
[MJCONSORT] 2021-03-21 22:26 37 - BinaryLogReader - Found WriteEvent on log_pos:35937878 TABLE:patients
[MJCONSORT] 2021-03-21 22:26 37 - BinaryLogReader - Found WriteEvent on log_pos:35939312 TABLE:patients
[MJCONSORT] 2021-03-21 22:26 37 - BinaryLogReader - Found WriteEvent on log_pos:35940696 TABLE:patients
[MJCONSORT] 2021-03-21 22:26 37 - BinaryLogReader - Found WriteEvent on log_pos:35942082 TABLE:patients
[MJCONSORT] 2021-03-21 22:26 37 - BinaryLogReader - Found WriteEvent on log_pos:35943476 TABLE:patients
[MJCONSORT] 2021-03-21 22:26 37 - BinaryLogReader - Found WriteEvent on log_pos:35944854 TABLE:patients
[MJCONSORT] 2021-03-21 22:26 37 - BinaryLogReader - Found WriteEvent on log_pos:35946240 TABLE:patients
[MJCONSORT] 2021-03-21 22:26 37 - BinaryLogReader - Found WriteEvent on log_pos:35947642 TABLE:patients
[MJCONSORT] 2021-03-21 22:26 38 - BinaryLogReader - Found WriteEvent on log_pos:35949068 TABLE:patients
[MJCONSORT] 2021-03-21 22:26 38 - BinaryLogReader - Found WriteEvent on log_pos:35950486 TABLE:patients
[MJCONSORT] 2021-03-21 22:26 38 - BinaryLogReader - Found WriteEvent on log_pos:35951884 TABLE:patients
[MJCONSORT] 2021-03-21 22:26 38 - BinaryLogReader - Found WriteEvent on log_pos:35953304 TABLE:patients
[MJCONSORT] 2021-03-21 22:26 38 - BinaryLogReader - Found WriteEvent on log_pos:35954738 TABLE:patients
[MJCONSORT] 2021-03-21 22:26 38 - BinaryLogReader - Found WriteEvent on log_pos:35956122 TABLE:patients
[MJCONSORT] 2021-03-21 22:26 38 - BinaryLogReader - Found WriteEvent on log_pos:35957520 TABLE:patients
[MJCONSORT] 2021-03-21 22:26 39 - BinaryLogReader - Found WriteEvent on log_pos:35958924 TABLE:patients
[MJCONSORT] 2021-03-21 22:26 39 - BinaryLogReader - Found WriteEvent on log_pos:35960336 TABLE:patients
[MJCONSORT] 2021-03-21 22:26 39 - BinaryLogReader - Found WriteEvent on log_pos:35961724 TABLE:patients
[MJCONSORT] 2021-03-21 22:26 39 - BinaryLogReader - Found WriteEvent on log_pos:35963140 TABLE:patients
[MJCONSORT] 2021-03-21 22:26 39 - BinaryLogReader - Found WriteEvent on log_pos:35964540 TABLE:patients
[MJCONSORT] 2021-03-21 22:26 40 - BinaryLogReader - Found WriteEvent on log_pos:35965914 TABLE:patients
[MJCONSORT] 2021-03-21 22:26 40 - BinaryLogReader - Found WriteEvent on log_pos:35967284 TABLE:patients
[MJCONSORT] 2021-03-21 22:26 40 - BinaryLogReader - Found WriteEvent on log_pos:35968672 TABLE:patients
[MJCONSORT] 2021-03-21 22:26 40 - BinaryLogReader - Found WriteEvent on log_pos:35970058 TABLE:patients
[MJCONSORT] 2021-03-21 22:26 41 - BinaryLogReader - Found WriteEvent on log_pos:35971476 TABLE:patients
[MJCONSORT] 2021-03-21 22:26 41 - BinaryLogReader - Found WriteEvent on log_pos:35972898 TABLE:patients
[MJCONSORT] 2021-03-21 22:26 41 - BinaryLogReader - Found WriteEvent on log_pos:35974308 TABLE:patients
[MJCONSORT] 2021-03-21 22:26 41 - BinaryLogReader - Found WriteEvent on log_pos:35975676 TABLE:patients
[MJCONSORT] 2021-03-21 22:26 41 - BinaryLogReader - Found WriteEvent on log_pos:35977104 TABLE:patients
[MJCONSORT] 2021-03-21 22:26 41 - BinaryLogReader - Found WriteEvent on log_pos:35978500 TABLE:patients
[MJCONSORT] 2021-03-21 22:26 41 - BinaryLogReader - Found WriteEvent on log_pos:35979936 TABLE:patients
[MJCONSORT] 2021-03-21 22:26 42 - BinaryLogReader - Found WriteEvent on log_pos:35981370 TABLE:patients
[MJCONSORT] 2021-03-21 22:26 42 - BinaryLogReader - Found WriteEvent on log_pos:35982834 TABLE:patients
[MJCONSORT] 2021-03-21 22:26 42 - BinaryLogReader - Found WriteEvent on log_pos:35984252 TABLE:patients
[MJCONSORT] 2021-03-21 22:26 42 - BinaryLogReader - Found WriteEvent on log_pos:35985650 TABLE:patients
[MJCONSORT] 2021-03-21 22:26 42 - BinaryLogReader - Found WriteEvent on log_pos:35987062 TABLE:patients
[MJCONSORT] 2021-03-21 22:26 43 - BinaryLogReader - Found WriteEvent on log_pos:35988436 TABLE:patients
[MJCONSORT] 2021-03-21 22:26 43 - BinaryLogReader - Found WriteEvent on log_pos:35989804 TABLE:patients
[MJCONSORT] 2021-03-21 22:26 43 - BinaryLogReader - Found WriteEvent on log_pos:35991184 TABLE:patients
[MJCONSORT] 2021-03-21 22:26 43 - BinaryLogReader - Found WriteEvent on log_pos:35992576 TABLE:patients
[MJCONSORT] 2021-03-21 22:26 43 - BinaryLogReader - Found WriteEvent on log_pos:35993980 TABLE:patients
[MJCONSORT] 2021-03-21 22:26 43 - BinaryLogReader - Found WriteEvent on log_pos:35995374 TABLE:patients
[MJCONSORT] 2021-03-21 22:26 43 - BinaryLogReader - Found WriteEvent on log_pos:35996804 TABLE:patients
[MJCONSORT] 2021-03-21 22:26 44 - BinaryLogReader - Found WriteEvent on log_pos:35998210 TABLE:patients
[MJCONSORT] 2021-03-21 22:26 44 - BinaryLogReader - Found WriteEvent on log_pos:35999612 TABLE:patients
[MJCONSORT] 2021-03-21 22:26 44 - BinaryLogReader - Found WriteEvent on log_pos:36001022 TABLE:patients
[MJCONSORT] 2021-03-21 22:26 44 - BinaryLogReader - Found WriteEvent on log_pos:36002392 TABLE:patients
[MJCONSORT] 2021-03-21 22:26 44 - BinaryLogReader - Found WriteEvent on log_pos:36003828 TABLE:patients
[MJCONSORT] 2021-03-21 22:26 44 - BinaryLogReader - Found WriteEvent on log_pos:36005248 TABLE:patients
[MJCONSORT] 2021-03-21 22:26 44 - BinaryLogReader - Found WriteEvent on log_pos:36006596 TABLE:patients
[MJCONSORT] 2021-03-21 22:26 44 - BinaryLogReader - Found WriteEvent on log_pos:36008056 TABLE:patients
[MJCONSORT] 2021-03-21 22:26 44 - BinaryLogReader - Found WriteEvent on log_pos:36009422 TABLE:patients
[MJCONSORT] 2021-03-21 22:26 44 - BinaryLogReader - Found WriteEvent on log_pos:36010800 TABLE:patients
[MJCONSORT] 2021-03-21 22:26 44 - BinaryLogReader - Found WriteEvent on log_pos:36012182 TABLE:patients
[MJCONSORT] 2021-03-21 22:26 44 - BinaryLogReader - Found WriteEvent on log_pos:36013588 TABLE:patients
[MJCONSORT] 2021-03-21 22:26 45 - BinaryLogReader - Found WriteEvent on log_pos:36014972 TABLE:patients
[MJCONSORT] 2021-03-21 22:26 46 - BinaryLogReader - Found WriteEvent on log_pos:36016372 TABLE:patients
[MJCONSORT] 2021-03-21 22:26 46 - BinaryLogReader - Found WriteEvent on log_pos:36017800 TABLE:patients
[MJCONSORT] 2021-03-21 22:26 46 - BinaryLogReader - Found WriteEvent on log_pos:36019244 TABLE:patients
[MJCONSORT] 2021-03-21 22:26 47 - BinaryLogReader - Found WriteEvent on log_pos:36020666 TABLE:patients
[MJCONSORT] 2021-03-21 22:26 47 - BinaryLogReader - Found WriteEvent on log_pos:36022074 TABLE:patients
[MJCONSORT] 2021-03-21 22:26 47 - BinaryLogReader - Found WriteEvent on log_pos:36023452 TABLE:patients
[MJCONSORT] 2021-03-21 22:26 47 - BinaryLogReader - Found WriteEvent on log_pos:36024888 TABLE:patients
[MJCONSORT] 2021-03-21 22:26 47 - BinaryLogReader - Found WriteEvent on log_pos:36026266 TABLE:patients
[MJCONSORT] 2021-03-21 22:26 47 - BinaryLogReader - Found WriteEvent on log_pos:36027682 TABLE:patients
[MJCONSORT] 2021-03-21 22:26 47 - BinaryLogReader - Found WriteEvent on log_pos:36029100 TABLE:patients
[MJCONSORT] 2021-03-21 22:26 47 - BinaryLogReader - Found WriteEvent on log_pos:36030482 TABLE:patients
[MJCONSORT] 2021-03-21 22:26 47 - BinaryLogReader - Found WriteEvent on log_pos:36031888 TABLE:patients
[MJCONSORT] 2021-03-21 22:26 47 - BinaryLogReader - Found WriteEvent on log_pos:36033306 TABLE:patients
[MJCONSORT] 2021-03-21 22:26 48 - BinaryLogReader - Found WriteEvent on log_pos:36034782 TABLE:patients
[MJCONSORT] 2021-03-21 22:26 48 - BinaryLogReader - Found WriteEvent on log_pos:36036226 TABLE:patients
[MJCONSORT] 2021-03-21 22:26 49 - BinaryLogReader - Found WriteEvent on log_pos:36037616 TABLE:patients
[MJCONSORT] 2021-03-21 22:26 49 - BinaryLogReader - Found WriteEvent on log_pos:36039008 TABLE:patients
[MJCONSORT] 2021-03-21 22:26 49 - BinaryLogReader - Found WriteEvent on log_pos:36040442 TABLE:patients
[MJCONSORT] 2021-03-21 22:26 49 - BinaryLogReader - Found WriteEvent on log_pos:36041834 TABLE:patients
[MJCONSORT] 2021-03-21 22:26 49 - BinaryLogReader - Found WriteEvent on log_pos:36043208 TABLE:patients
[MJCONSORT] 2021-03-21 22:26 49 - BinaryLogReader - Found WriteEvent on log_pos:36044612 TABLE:patients
[MJCONSORT] 2021-03-21 22:26 49 - BinaryLogReader - Found WriteEvent on log_pos:36046028 TABLE:patients
[MJCONSORT] 2021-03-21 22:26 49 - BinaryLogReader - Found WriteEvent on log_pos:36047392 TABLE:patients
[MJCONSORT] 2021-03-21 22:27 17 - BinaryLogReader - Found DeleteEvent on log_pos:36050121 TABLE:hospital
