{
	// Update the 'dockerFile' property if you aren't using the standard 'Dockerfile' filename.
	"image": "uprev/template",


	// Add the IDs of extensions you want installed when the container is created.
	"extensions": [
		"ms-vscode.cpptools",
		"ms-python.python",
		"redhat.vscode-yaml",
		"ms-vscode.cmake-tools"
	],


	// Uncomment to connect as a non-root user if you've added one. See https://aka.ms/vscode-remote/containers/non-root.
	"remoteUser": "dev"
}
