{
  "name": "Flux database",
  "dockerComposeFile": "docker-compose.yml",
  "service": "flux_database",
  "workspaceFolder": "/app",
  "shutdownAction": "none",
  "extensions": ["jakebecker.elixir-ls"],
  "settings": {
    "elixir.autoSpawnElixirSenseServers": true,
    "elixir.useElixirSense": true
  }
}
