vcl 4.1;

import std;
import directors;
import re2;
import dynamic;
import selector;

include "bogo_backend.vcl";

probe vk8s_tea-svc_probe {
	.url = "/healthz";
	.expected_response = 204;
	.timeout = 5s;
	.interval = 5s;
	.initial = 2;
	.window = 8;
	.threshold = 3;
}

backend vk8s_tea-svc_192_0_2_1_80 {
	.host = "192.0.2.1";
	.port = "80";
	.host_header = "tea.svc.org";
	.connect_timeout = 1s;
	.first_byte_timeout = 2s;
	.between_bytes_timeout = 2s;
	.proxy_header = 1;
	.max_connections = 200;
	.probe = vk8s_tea-svc_probe;
}
backend vk8s_tea-svc_192_0_2_2_80 {
	.host = "192.0.2.2";
	.port = "80";
	.host_header = "tea.svc.org";
	.connect_timeout = 1s;
	.first_byte_timeout = 2s;
	.between_bytes_timeout = 2s;
	.proxy_header = 1;
	.max_connections = 200;
	.probe = vk8s_tea-svc_probe;
}
backend vk8s_tea-svc_192_0_2_3_80 {
	.host = "192.0.2.3";
	.port = "80";
	.host_header = "tea.svc.org";
	.connect_timeout = 1s;
	.first_byte_timeout = 2s;
	.between_bytes_timeout = 2s;
	.proxy_header = 1;
	.max_connections = 200;
	.probe = vk8s_tea-svc_probe;
}


sub vcl_init {
	new caffeine = directors.shard_param();
	new vk8s_tea-svc_director = directors.shard();
	vk8s_tea-svc_director.add_backend(vk8s_tea-svc_192_0_2_1_80
		);
	vk8s_tea-svc_director.add_backend(vk8s_tea-svc_192_0_2_2_80
		);
	vk8s_tea-svc_director.add_backend(vk8s_tea-svc_192_0_2_3_80
		);
	vk8s_tea-svc_director.set_warmup(0.5);
	vk8s_tea-svc_director.set_rampup(5m);
	vk8s_tea-svc_director.associate(caffeine.use());
	vk8s_tea-svc_director.reconfigure();
}



sub vcl_backend_fetch {
	set bereq.backend = vk8s_notfound;

	if (bereq.backend == vk8s_notfound) {
		set bereq.backend = vk8s_tea-svc_director.backend();
	}
}
