vcl 4.1;

import std;
import directors;
import re2;
import dynamic;
import selector;

include "bogo_backend.vcl";

backend vk8s_default_tea-5798f99dc5-5wj8n_80 {
	.host = "192.0.2.1";
	.port = "80";
}
backend vk8s_default_tea-5798f99dc5-hn27l_80 {
	.host = "192.0.2.2";
	.port = "80";
}
backend vk8s_default_tea-5798f99dc5-5wj8n_80 {
	.host = "192.0.2.3";
	.port = "80";
}


sub vcl_init {
	new vk8s_tea-svc_director = directors.round_robin();
	vk8s_tea-svc_director.add_backend(vk8s_default_tea-5798f99dc5-5wj8n_80
		);
	vk8s_tea-svc_director.add_backend(vk8s_default_tea-5798f99dc5-hn27l_80
		);
	vk8s_tea-svc_director.add_backend(vk8s_default_tea-5798f99dc5-5wj8n_80
		);
}



sub vcl_backend_fetch {
	set bereq.backend = vk8s_notfound;

	if (bereq.backend == vk8s_notfound) {
		set bereq.backend = vk8s_tea-svc_director.backend();
	}
}
