1,yves,1234,Yves,Lemasson,12/03/1985
2,yves,1234,Yves,Lemasson,12/03/1985
3,yves,1234,Yves,Lemasson,12/03/1985
4,yves,1234,Yves,Lemasson,12/03/1985
5,yves,1234,Yves,Lemasson,12/03/1985
6,yves,1234,Yves,Lemasson,12/03/1985
7,yves,1234,Yves,Lemasson,
8,pepe,1234,"Juan Carlos",Alcañiz,
9,pepe,1234,"Juan Carlos",Alcañiz,2019-11-08
10,pepe,1234,lemasson,Alcañiz,2019-04-27
11,pepe,1234,lemasson,Alcañiz,2019-04-27
12,pepe,1234,lemasson,Alcañiz,2019-04-27
13,pepe,1234,lemasson,Alcañiz,2019-04-27
14,juan,1234,"Juan Carlos",Alcañiz,2019-04-20
15,juan,1234,"Juan Carlos",Alcañiz,2019-04-20
16,juan,1234,Yves,Lemasson,1985-03-12
17,Alberto,4321,Alberto,Guzmán,1996-02-02
18,Alberto,6543,Fermín,Cacho,2019-04-04
19,pepe,1234,"Juan Carlos",Alcañiz,2019-04-06
20,yves,1234,"Juan Carlos",Alcañiz,2019-04-06
21,pepito,6543,pepito,Grillo,2018-12-13
