{
    "extends": [
        "tslint-angular"
    ],
    "rules": {
      "member-ordering": false,
      "no-empty-interface": false,
      "no-use-before-declare": false,
      "callable-types": false,
      "no-unused-expression": false,
      "no-console": true,
        "directive-selector": [
            true,
            "attribute",
            [
                "dir-prefix1",
                "dir-prefix2"
            ],
            "camelCase"
        ],
        "component-selector": [
            true,
            "element",
            [
                "cmp-prefix1",
                "cmp-prefix2"
            ],
            "kebab-case"
        ]
    }
}