{
  "project_info": {
    "project_number": "877923781231",
    "firebase_url": "https://upchieve-a3ea2.firebaseio.com",
    "project_id": "upchieve-a3ea2",
    "storage_bucket": "upchieve-a3ea2.appspot.com"
  },
  "client": [
    {
      "client_info": {
        "mobilesdk_app_id": "1:877923781231:android:55f2cae74267f273a21b9a",
        "android_client_info": {
          "package_name": "org.upchieve.mobile"
        }
      },
      "oauth_client": [
        {
          "client_id": "877923781231-5pm0jsho3lago4p4j0dgcojhv1qtgn82.apps.googleusercontent.com",
          "client_type": 3
        }
      ],
      "api_key": [
        {
          "current_key": "AIzaSyDN0I5SHHWSeepBErsujLknXZPJInvhFtE"
        }
      ],
      "services": {
        "appinvite_service": {
          "other_platform_oauth_client": [
            {
              "client_id": "877923781231-5pm0jsho3lago4p4j0dgcojhv1qtgn82.apps.googleusercontent.com",
              "client_type": 3
            },
            {
              "client_id": "877923781231-ul8f17kkpfkh5pm2reh6ockq0cuvbd99.apps.googleusercontent.com",
              "client_type": 2,
              "ios_info": {
                "bundle_id": "org.upchieve.mobile"
              }
            }
          ]
        }
      }
    }
  ],
  "configuration_version": "1"
}