<svg width="24" height="24" viewBox="0 0 24 24" fill="none" xmlns="http://www.w3.org/2000/svg">
<g id="Group 657">
<circle id="Ellipse 25" cx="12" cy="12" r="11.5" stroke="#F44747"/>
<rect id="Rectangle 528" x="8.40002" y="8.39996" width="7.2" height="7.2" rx="1" fill="#F44747"/>
</g>
</svg>
