<svg width="20" height="20" viewBox="0 0 20 20" fill="none" xmlns="http://www.w3.org/2000/svg">
  <path fill-rule="evenodd" clip-rule="evenodd" d="M7.81081 9.78682C7.65275 9.91185 7.48976 10.0139 7.34144 10.0613V13.8937C7.34144 14.4296 7.51291 14.9129 7.81081 15.2725C8.13909 15.6686 8.6209 15.9144 9.19595 15.9144H14.4498C14.6563 15.9144 14.864 15.8312 15.0097 15.6857C15.1336 15.5609 15.1956 15.3737 15.1956 15.2085C15.1956 15.0606 15.1543 14.915 15.0705 14.8122C14.9466 14.625 14.9259 14.4159 15.0097 14.2068C15.0923 14 15.2782 13.874 15.4847 13.8313C15.8163 13.7701 16.0641 13.4777 16.0641 13.145C16.0641 12.9994 16.024 12.8527 15.9184 12.7279C15.7945 12.5823 15.7544 12.3952 15.7945 12.208C15.8358 12.0197 15.9609 11.8729 16.1261 11.7909C16.3739 11.6661 16.5197 11.4362 16.4979 11.1659C16.4979 10.8735 16.3338 10.624 16.0641 10.52C15.8358 10.4357 15.6912 10.2485 15.6706 10.0197C15.6499 9.79097 15.7544 9.56221 15.9402 9.43627C16.1468 9.2907 16.2707 9.03998 16.25 8.79042C16.2099 8.45652 15.8565 8.16653 15.5054 8.16653H12.6496C12.4029 8.16653 12.1539 8.04059 11.9887 7.85342C11.8234 7.6443 11.7408 7.39474 11.7821 7.14518L11.968 5.68711C12.0105 5.4156 11.9887 5.18684 11.9474 4.99967C11.8604 4.63132 11.6743 4.30724 11.4199 4.05547C11.4037 4.03943 11.3873 4.02368 11.3705 4.00823C11.2043 3.855 11.0117 3.73137 10.8003 3.64442C10.5734 3.55106 10.3249 3.5 10.0645 3.5C10.0232 3.5 9.9819 3.5208 9.96125 3.54159C9.9406 3.56239 9.91994 3.60283 9.91994 3.64442V5.35321C9.91994 6.29137 9.65031 7.20757 9.15464 7.999L8.43065 9.16592C8.28202 9.35146 8.05216 9.59593 7.81081 9.78682ZM7.29743 8.14722C6.93743 7.75231 6.41882 7.5045 5.84234 7.5045H3.96847C2.88131 7.5045 2 8.38582 2 9.47297V16.0315C2 17.1187 2.88131 18 3.96847 18H5.84234C6.5794 18 7.22185 17.5949 7.55919 16.9952C8.02476 17.2599 8.57465 17.4144 9.19595 17.4144H14.4498C15.0398 17.4144 15.6331 17.1832 16.0699 16.7468L16.074 16.7426C16.5266 16.287 16.6956 15.6934 16.6956 15.2085C16.6956 15.1133 16.6894 15.0112 16.6751 14.9051C17.2135 14.504 17.5641 13.8647 17.5641 13.145C17.5641 12.9702 17.5436 12.7814 17.4936 12.5887C17.8252 12.2015 18.0284 11.69 17.997 11.1055C17.9843 10.6295 17.8207 10.1726 17.5315 9.80373C17.6975 9.46075 17.7784 9.07098 17.7449 8.66671L17.7426 8.63896L17.7393 8.61131C17.6637 7.9828 17.316 7.50175 16.9539 7.20034C16.5888 6.89646 16.0821 6.66653 15.5054 6.66653H13.3553L13.4537 5.89493C13.5246 5.41968 13.4855 5.00879 13.4121 4.67642L13.4097 4.66566L13.4072 4.65494C13.0448 3.12005 11.6882 2 10.0645 2C9.59591 2 9.17905 2.20052 8.89692 2.48462C8.62401 2.75943 8.41994 3.17033 8.41994 3.64442V5.35321C8.41994 6.00355 8.23291 6.64473 7.88339 7.20282L7.29743 8.14722ZM17.0607 11.7556C17.0616 11.7568 17.0626 11.758 17.0636 11.7591L17.0607 11.7556ZM6.31081 9.47297C6.31081 9.21424 6.10107 9.0045 5.84234 9.0045H3.96847C3.70974 9.0045 3.5 9.21424 3.5 9.47297V16.0315C3.5 16.2903 3.70974 16.5 3.96847 16.5H5.84234C6.10107 16.5 6.31081 16.2903 6.31081 16.0315V9.47297Z" fill="#666F7D"/>
</svg>
