353.59 85.92 
48.65 12.20 
47.06 80.23 
25.99 38.97 
45.64 65.96 
77.64 38.28 
83.18 14.51 
78.50 85.62 
8.10 77.27 
-2717.24 5360.42 
16.90 66.18 
12.42 32.47 
90.93 54.80 
54.18 79.42 
48.99 70.64 
74.55 16.91 
-99.36 -251.10 
-406.67 -54.11 
782.37 -1278.24 
8.37 64.68 
73.55 25.28 
86.00 90.59 
82.85 85.83 
20.01 46.45 
126.03 77.86 
49.63 86.37 
19.77 44.45 
30.58 91.35 
142.05 89.46 
14.55 63.38 
40.74 10.46 
26.00 104.59 
-22.66 16.21 
84.18 48.17 
10.43 34.43 
68.39 18.00 
26.86 105.76 
279.38 20.50 
-14.25 44.09 
80.73 75.69 
88.70 43.17 
86.52 85.09 
100.29 86.13 
48.32 -11.24 
27.19 105.25 
45.84 68.30 
42.14 9.78 
0.83 -64.11 
52.30 180.41 
86.20 80.28 
22.41 51.16 
124.16 97.15 
-124.87 270.48 
-35.89 406.81 
61.26 76.64 
135.76 83.51 
14.02 27.22 
29.68 95.08 
50.25 24.03 
-324.80 -68.02 
38.29 23.94 
61.39 18.66 
51.18 58.71 
42.86 10.43 
34.21 54.01 
111.61 25.50 
63.88 20.86 
60.47 49.77 
19.53 84.18 
44.08 63.27 
70.34 56.61 
44.39 34.40 
20.69 92.25 
178.34 -212.17 
50.35 7.97 
72.14 11.27 
37.85 97.84 
253.64 28.15 
73.41 20.59 
89.26 33.04 
106.95 127.02 
57.79 45.80 
18.63 29.29 
40.60 14.20 
49.45 50.80 
47.21 43.03 
54.67 10.91 
7.02 85.58 
45.97 75.55 
23.64 61.82 
5.52 96.02 
34.28 23.29 
15.04 17.22 
137.83 165.69 
27.90 89.70 
36.38 23.73 
-251.92 169.12 
141.09 -397.68 
63.00 281.57 
35.17 90.41 

