{
  "files": {
    "main.css": "/static/css/main.3c0c2136.css",
    "main.js": "/static/js/main.29516692.js",
    "static/media/hackathonPic.jpg": "/static/media/hackathonPic.20106686a6c679f0b420.jpg",
    "static/media/SpeakerPic.jpg": "/static/media/SpeakerPic.ce3c1df1b0185c49b061.jpg",
    "static/media/Header_BG.mp4": "/static/media/Header_BG.6ce145c4e7c1a28964a0.mp4",
    "static/media/marketingPic.jpg": "/static/media/marketingPic.5c75e1ed88691cace5bf.jpg",
    "static/media/funPic.jpeg": "/static/media/funPic.2f697da1a8bfacbed5d1.jpeg",
    "static/media/secretaryPic.jpg": "/static/media/secretaryPic.3893077b9528d2fdfa74.jpg",
    "static/media/icpcPic.jpeg": "/static/media/icpcPic.0bc1911b3030f815d135.jpeg",
    "static/media/instagramLogo.webp": "/static/media/instagramLogo.e905e80e3d57cc2b32c7.webp",
    "static/media/codeathonPic.jpg": "/static/media/codeathonPic.cf93301deef87e25600b.jpg",
    "static/media/vicePresidentPic.jpg": "/static/media/vicePresidentPic.04185896770229963cec.jpg",
    "static/media/WorkshopPic.jpg": "/static/media/WorkshopPic.7dafb7854a095d714cd9.jpg",
    "static/media/leetcoderPic.jpg": "/static/media/leetcoderPic.ec05d7d07c8779663563.jpg",
    "static/media/socialPic.jpg": "/static/media/socialPic.2f4ea2d649d6a143d7d0.jpg",
    "static/media/presidentPic.png": "/static/media/presidentPic.39d4a44be77186e8823b.png",
    "static/media/treasurerPic.jpg": "/static/media/treasurerPic.7ab4b58a0362a51a9dac.jpg",
    "static/media/webmasterPic.jpg": "/static/media/webmasterPic.d989035ef7c2b7e1dc73.jpg",
    "static/media/logo.png": "/static/media/logo.149c254f91693a0b7b24.png",
    "static/media/discordLogo.webp": "/static/media/discordLogo.e66897f0cf044727bb4a.webp",
    "static/media/BlueLogo.png": "/static/media/BlueLogo.4e3d4d2c3a057f212e2b.png",
    "index.html": "/index.html",
    "main.3c0c2136.css.map": "/static/css/main.3c0c2136.css.map",
    "main.29516692.js.map": "/static/js/main.29516692.js.map"
  },
  "entrypoints": [
    "static/css/main.3c0c2136.css",
    "static/js/main.29516692.js"
  ]
}