/Users/andresantos/workspace/rest2uaal/src/main/java/mainpackage/Activator.java
/Users/andresantos/workspace/rest2uaal/src/main/java/rest/RestClient.java
/Users/andresantos/workspace/rest2uaal/src/main/java/ontologies/HumiditySensorOntology.java
/Users/andresantos/workspace/rest2uaal/src/main/java/storage/DbOperations.java
/Users/andresantos/workspace/rest2uaal/src/main/java/ontologies/HumiditySensor.java
/Users/andresantos/workspace/rest2uaal/src/main/java/ontologies/SensorFactory.java
/Users/andresantos/workspace/rest2uaal/src/main/java/middleware/Middleware.java
/Users/andresantos/workspace/rest2uaal/src/main/java/utils/Constants.java
