{
    "name": "generic-x86",
    "arch": "i386",
    "toolchains": {
        "llvm": {
            "targetTriple": {
                "arch": "i386",
                "vendor": "pc",
                "sys": "none",
                "env": "elf"
            }
        },
        "zig": {
            "targetTriple": {
                "arch": "i386",
                "sys": "freestanding"
            }
        }
    }
}