EESchema Schematic File Version 5
EELAYER 30 0
EELAYER END
$Descr A4 11693 8268
encoding utf-8
Sheet 1 1
Title "Emission Deboard"
Date "2019-06-18"
Rev ""
Comp "UNIWA"
Comment1 ""
Comment2 ""
Comment3 ""
Comment4 ""
Comment5 ""
Comment6 ""
Comment7 ""
Comment8 ""
Comment9 ""
$EndDescr
$Comp
L Device:Battery_Cell BT1
U 1 1 5CF62B53
P 1850 6250
F 0 "BT1" H 1968 6346 50  0000 L CNN
F 1 "Battery_Cell" H 1968 6255 50  0000 L CNN
F 2 "Battery:BatteryHolder_Keystone_3000_1x12mm" V 1850 6310 50  0001 C CNN
F 3 "~" V 1850 6310 50  0001 C CNN
F 4 "3000" H 1850 6250 50  0001 C CNN "Part Number"
	1    1850 6250
	1    0    0    -1  
$EndComp
Wire Wire Line
	1850 5750 1850 6050
Text Label 1900 5750 0    50   ~ 0
VBAT
Text Label 3350 5450 0    50   ~ 0
PA0
Text Label 3350 5550 0    50   ~ 0
PA1
Text Label 3350 5650 0    50   ~ 0
PA4
Text Label 3350 5750 0    50   ~ 0
PB0
Text Label 8250 2100 2    50   ~ 0
SCL_PB8
Text Label 8250 2200 2    50   ~ 0
SDA_PB9
Text Label 9000 4700 2    50   ~ 0
ESP_RX
Text Label 9650 4250 2    50   ~ 0
ESP_TX
$Comp
L power:+5V #PWR0101
U 1 1 5CF66EC7
P 3950 5350
F 0 "#PWR0101" H 3950 5200 50  0001 C CNN
F 1 "+5V" H 3965 5523 50  0000 C CNN
F 2 "" H 3950 5350 50  0001 C CNN
F 3 "" H 3950 5350 50  0001 C CNN
	1    3950 5350
	1    0    0    -1  
$EndComp
$Comp
L power:GND #PWR0102
U 1 1 5CF678AD
P 3950 5950
F 0 "#PWR0102" H 3950 5700 50  0001 C CNN
F 1 "GND" H 3955 5777 50  0000 C CNN
F 2 "" H 3950 5950 50  0001 C CNN
F 3 "" H 3950 5950 50  0001 C CNN
	1    3950 5950
	1    0    0    -1  
$EndComp
$Comp
L power:GND #PWR0103
U 1 1 5CF68979
P 1850 6400
F 0 "#PWR0103" H 1850 6150 50  0001 C CNN
F 1 "GND" H 1855 6227 50  0000 C CNN
F 2 "" H 1850 6400 50  0001 C CNN
F 3 "" H 1850 6400 50  0001 C CNN
	1    1850 6400
	1    0    0    -1  
$EndComp
Wire Wire Line
	3950 5850 3950 5950
Wire Wire Line
	1850 6350 1850 6400
Wire Wire Line
	3950 5450 3950 5650
Connection ~ 3950 5850
Connection ~ 3950 5650
Wire Wire Line
	3950 5650 3950 5850
Wire Wire Line
	3850 5650 3100 5650
Wire Wire Line
	4050 5850 3950 5850
Wire Wire Line
	4050 5650 3950 5650
Wire Wire Line
	4050 5550 3850 5550
Wire Wire Line
	4050 5450 3950 5450
Wire Wire Line
	4050 5350 3950 5350
$Comp
L Connector_Generic:Conn_01x06 J2
U 1 1 5CF65DFE
P 4250 5550
F 0 "J2" H 4330 5542 50  0000 L CNN
F 1 "NO2" H 4330 5451 50  0000 L CNN
F 2 "Connector_JST:JST_XH_B6B-XH-A_1x06_P2.50mm_Vertical" H 4250 5550 50  0001 C CNN
F 3 "~" H 4250 5550 50  0001 C CNN
F 4 "B6B-XH-A" H 4250 5550 50  0001 C CNN "Part Number"
	1    4250 5550
	1    0    0    -1  
$EndComp
Wire Wire Line
	3850 5550 3850 5650
Wire Wire Line
	3100 5750 4050 5750
$Comp
L emission:NUCLEO64-F091 CN7
U 1 1 5CF34DAF
P 2650 5050
F 0 "CN7" H 2650 6050 50  0000 C CNN
F 1 "Conn_02x19_Odd_Even" H 2700 6076 50  0001 C CNN
F 2 "Connector_PinSocket_2.54mm:PinSocket_2x19_P2.54mm_Vertical" H 2650 5050 50  0001 C CNN
F 3 "~" H 2650 5050 50  0001 C CNN
	1    2650 5050
	1    0    0    -1  
$EndComp
Wire Wire Line
	3100 5550 3700 5550
Wire Wire Line
	3700 5550 3700 4600
Wire Wire Line
	3600 5450 3100 5450
Wire Wire Line
	3600 4400 3600 5450
$Comp
L Connector_Generic:Conn_01x06 J1
U 1 1 5CF731C2
P 4250 4400
F 0 "J1" H 4330 4392 50  0000 L CNN
F 1 "O3" H 4330 4301 50  0000 L CNN
F 2 "Connector_JST:JST_XH_B6B-XH-A_1x06_P2.50mm_Vertical" H 4250 4400 50  0001 C CNN
F 3 "~" H 4250 4400 50  0001 C CNN
F 4 "B6B-XH-A" H 4250 4400 50  0001 C CNN "Part Number"
	1    4250 4400
	1    0    0    -1  
$EndComp
Wire Wire Line
	4050 4200 4000 4200
Wire Wire Line
	4050 4300 4000 4300
Wire Wire Line
	4050 4500 4000 4500
Wire Wire Line
	4050 4700 4000 4700
Wire Wire Line
	4000 4500 4000 4700
Connection ~ 4000 4500
Connection ~ 4000 4700
Wire Wire Line
	4000 4300 4000 4500
Wire Wire Line
	4000 4700 4000 4750
Wire Wire Line
	4000 4200 4000 4150
$Comp
L power:GND #PWR0104
U 1 1 5CF731B1
P 4000 4750
F 0 "#PWR0104" H 4000 4500 50  0001 C CNN
F 1 "GND" H 4005 4577 50  0000 C CNN
F 2 "" H 4000 4750 50  0001 C CNN
F 3 "" H 4000 4750 50  0001 C CNN
	1    4000 4750
	1    0    0    -1  
$EndComp
$Comp
L power:+5V #PWR0105
U 1 1 5CF731AB
P 4000 4150
F 0 "#PWR0105" H 4000 4000 50  0001 C CNN
F 1 "+5V" H 4015 4323 50  0000 C CNN
F 2 "" H 4000 4150 50  0001 C CNN
F 3 "" H 4000 4150 50  0001 C CNN
	1    4000 4150
	1    0    0    -1  
$EndComp
Wire Wire Line
	3600 4400 4050 4400
Wire Wire Line
	3700 4600 4050 4600
Wire Wire Line
	7850 950  7850 2100
$Comp
L Connector_Generic:Conn_01x08 J4
U 1 1 5CF918BA
P 10300 1400
F 0 "J4" H 10380 1392 50  0000 L CNN
F 1 "PMS 5003" H 10380 1301 50  0000 L CNN
F 2 "Connector_Molex:Molex_PicoBlade_53047-0810_1x08_P1.25mm_Vertical" H 10300 1400 50  0001 C CNN
F 3 "~" H 10300 1400 50  0001 C CNN
F 4 "53047-0810" H 10300 1400 50  0001 C CNN "Part Number"
	1    10300 1400
	1    0    0    1   
$EndComp
Wire Wire Line
	7750 950  7750 2200
$Comp
L power:+3.3V #PWR01
U 1 1 5CF8BBC0
P 8350 1000
F 0 "#PWR01" H 8350 850 50  0001 C CNN
F 1 "+3.3V" H 8365 1173 50  0000 C CNN
F 2 "" H 8350 1000 50  0001 C CNN
F 3 "" H 8350 1000 50  0001 C CNN
	1    8350 1000
	-1   0    0    -1  
$EndComp
$Comp
L power:GND #PWR02
U 1 1 5CF896F4
P 7950 1000
F 0 "#PWR02" H 7950 750 50  0001 C CNN
F 1 "GND" H 7955 827 50  0000 C CNN
F 2 "" H 7950 1000 50  0001 C CNN
F 3 "" H 7950 1000 50  0001 C CNN
	1    7950 1000
	-1   0    0    -1  
$EndComp
Wire Wire Line
	8050 1000 8350 1000
Wire Wire Line
	7950 950  7950 1000
Wire Wire Line
	8050 950  8050 1000
$Comp
L Connector_Generic:Conn_01x04 J3
U 1 1 5CF896E4
P 7950 750
F 0 "J3" V 7914 462 50  0000 R CNN
F 1 "BME280" V 7823 462 50  0000 R CNN
F 2 "Connector_JST:JST_XH_B4B-XH-A_1x04_P2.50mm_Vertical" H 7950 750 50  0001 C CNN
F 3 "~" H 7950 750 50  0001 C CNN
F 4 "B4B-XH-A" H 7950 750 50  0001 C CNN "Part Number"
	1    7950 750 
	0    1    -1   0   
$EndComp
$Comp
L power:+5V #PWR0106
U 1 1 5CF94083
P 10350 2650
F 0 "#PWR0106" H 10350 2500 50  0001 C CNN
F 1 "+5V" V 10365 2778 50  0000 L CNN
F 2 "" H 10350 2650 50  0001 C CNN
F 3 "" H 10350 2650 50  0001 C CNN
	1    10350 2650
	0    -1   -1   0   
$EndComp
$Comp
L power:GND #PWR0107
U 1 1 5CF94089
P 9750 1100
F 0 "#PWR0107" H 9750 850 50  0001 C CNN
F 1 "GND" V 9755 972 50  0000 R CNN
F 2 "" H 9750 1100 50  0001 C CNN
F 3 "" H 9750 1100 50  0001 C CNN
	1    9750 1100
	0    1    1    0   
$EndComp
Wire Wire Line
	10100 1000 10100 950 
Wire Wire Line
	10100 1100 9750 1100
Text Label 10100 1200 2    50   ~ 0
PMS_SET
Text Label 10100 1300 2    50   ~ 0
PMS_RX
Text Label 10100 1500 2    50   ~ 0
PMS_RESET
Wire Wire Line
	10100 1200 9650 1200
Wire Wire Line
	10100 1500 9750 1500
NoConn ~ 10100 1600
NoConn ~ 10100 1700
$Comp
L Connector_Generic:Conn_01x07 J6
U 1 1 5CFACC99
P 10650 2450
F 0 "J6" H 10730 2442 50  0000 L CNN
F 1 "GPS/GPRS" H 10730 2351 50  0000 L CNN
F 2 "Connector_JST:JST_XH_B7B-XH-A_1x07_P2.50mm_Vertical" H 10650 2450 50  0001 C CNN
F 3 "~" H 10650 2450 50  0001 C CNN
F 4 "B7B-XH-A" H 10650 2450 50  0001 C CNN "Part Number"
	1    10650 2450
	1    0    0    -1  
$EndComp
Wire Wire Line
	10300 4250 10300 4450
$Comp
L power:GND #PWR0108
U 1 1 5CFB84E6
P 10300 4450
F 0 "#PWR0108" H 10300 4200 50  0001 C CNN
F 1 "GND" H 10305 4277 50  0000 C CNN
F 2 "" H 10300 4450 50  0001 C CNN
F 3 "" H 10300 4450 50  0001 C CNN
	1    10300 4450
	-1   0    0    -1  
$EndComp
$Comp
L Connector_Generic:Conn_02x04_Odd_Even J5
U 1 1 5CFAD8B9
P 9950 4350
F 0 "J5" H 10000 4667 50  0000 C CNN
F 1 "ESP8266" H 10000 4576 50  0000 C CNN
F 2 "Connector_PinSocket_2.54mm:PinSocket_2x04_P2.54mm_Vertical" H 9950 4350 50  0001 C CNN
F 3 "~" H 9950 4350 50  0001 C CNN
	1    9950 4350
	-1   0    0    -1  
$EndComp
$Comp
L power:+3.3V #PWR0109
U 1 1 5CFC2733
P 9150 4550
F 0 "#PWR0109" H 9150 4400 50  0001 C CNN
F 1 "+3.3V" V 9165 4678 50  0000 L CNN
F 2 "" H 9150 4550 50  0001 C CNN
F 3 "" H 9150 4550 50  0001 C CNN
	1    9150 4550
	0    -1   -1   0   
$EndComp
Wire Wire Line
	9150 4550 9650 4550
Wire Wire Line
	10150 4700 8050 4700
Wire Wire Line
	8050 4700 8050 4450
Wire Wire Line
	10150 4550 10150 4700
Wire Wire Line
	9650 4250 8200 4250
Wire Wire Line
	8200 4250 8200 3600
$Comp
L power:+5V #PWR0110
U 1 1 5CFCE750
P 10100 950
F 0 "#PWR0110" H 10100 800 50  0001 C CNN
F 1 "+5V" H 10115 1123 50  0000 C CNN
F 2 "" H 10100 950 50  0001 C CNN
F 3 "" H 10100 950 50  0001 C CNN
	1    10100 950 
	1    0    0    -1  
$EndComp
$Comp
L power:GND #PWR0111
U 1 1 5CFCF99A
P 10400 2850
F 0 "#PWR0111" H 10400 2600 50  0001 C CNN
F 1 "GND" H 10405 2677 50  0000 C CNN
F 2 "" H 10400 2850 50  0001 C CNN
F 3 "" H 10400 2850 50  0001 C CNN
	1    10400 2850
	1    0    0    -1  
$EndComp
Wire Wire Line
	10400 2750 10400 2850
Wire Wire Line
	10450 2750 10400 2750
Wire Wire Line
	10450 2450 9400 2450
Wire Wire Line
	9400 2450 9400 2200
Wire Wire Line
	10450 2550 9850 2550
Wire Wire Line
	9850 2550 9850 3600
Wire Wire Line
	7700 4250 8200 4250
Connection ~ 8200 4250
Wire Wire Line
	7700 4450 8050 4450
Connection ~ 8050 4450
Wire Wire Line
	8050 4450 8050 3000
$Comp
L power:GND #PWR0112
U 1 1 5CFD9F70
P 7100 5450
F 0 "#PWR0112" H 7100 5200 50  0001 C CNN
F 1 "GND" H 7105 5277 50  0000 C CNN
F 2 "" H 7100 5450 50  0001 C CNN
F 3 "" H 7100 5450 50  0001 C CNN
	1    7100 5450
	1    0    0    -1  
$EndComp
$Comp
L power:+3.3V #PWR0113
U 1 1 5CFDA810
P 7100 3950
F 0 "#PWR0113" H 7100 3800 50  0001 C CNN
F 1 "+3.3V" H 7115 4123 50  0000 C CNN
F 2 "" H 7100 3950 50  0001 C CNN
F 3 "" H 7100 3950 50  0001 C CNN
	1    7100 3950
	1    0    0    -1  
$EndComp
Wire Wire Line
	10150 4250 10300 4250
Text Label 9650 4350 2    50   ~ 0
CH_PD
Text Label 9650 4450 2    50   ~ 0
ESP_RST
Text Label 6500 4350 2    50   ~ 0
CH_PD
Text Label 6500 4150 2    50   ~ 0
ESP_RST
Wire Wire Line
	9650 4350 9300 4350
Text Label 10050 2550 0    50   ~ 0
GPS_RX
Text Label 10050 2450 0    50   ~ 0
GPS_TX
$Comp
L power:+3.3V #PWR0114
U 1 1 5D01B734
P 3100 4850
F 0 "#PWR0114" H 3100 4700 50  0001 C CNN
F 1 "+3.3V" V 3115 4978 50  0000 L CNN
F 2 "" H 3100 4850 50  0001 C CNN
F 3 "" H 3100 4850 50  0001 C CNN
	1    3100 4850
	0    1    1    0   
$EndComp
$Comp
L power:+5V #PWR0115
U 1 1 5D01C6B4
P 3100 4350
F 0 "#PWR0115" H 3100 4200 50  0001 C CNN
F 1 "+5V" V 3115 4478 50  0000 L CNN
F 2 "" H 3100 4350 50  0001 C CNN
F 3 "" H 3100 4350 50  0001 C CNN
	1    3100 4350
	0    1    1    0   
$EndComp
$Comp
L power:GND #PWR0116
U 1 1 5D01D651
P 3250 5050
F 0 "#PWR0116" H 3250 4800 50  0001 C CNN
F 1 "GND" H 3255 4877 50  0000 C CNN
F 2 "" H 3250 5050 50  0001 C CNN
F 3 "" H 3250 5050 50  0001 C CNN
	1    3250 5050
	1    0    0    -1  
$EndComp
Wire Wire Line
	3250 5050 3100 5050
Wire Wire Line
	3100 5050 3100 5150
Text Label 8250 2600 2    50   ~ 0
SPI1_MISO
Text Label 8250 2700 2    50   ~ 0
SPI1_MOSI
Text Label 7850 3500 2    50   ~ 0
SPI1_CLK
Text Label 7850 3400 2    50   ~ 0
SD_SEL
$Comp
L power:GND #PWR0117
U 1 1 5CFB2609
P 6450 2700
F 0 "#PWR0117" H 6450 2450 50  0001 C CNN
F 1 "GND" V 6455 2572 50  0000 R CNN
F 2 "" H 6450 2700 50  0001 C CNN
F 3 "" H 6450 2700 50  0001 C CNN
	1    6450 2700
	0    -1   -1   0   
$EndComp
$Comp
L power:+3.3V #PWR0118
U 1 1 5CFB3063
P 6450 2900
F 0 "#PWR0118" H 6450 2750 50  0001 C CNN
F 1 "+3.3V" V 6465 3028 50  0000 L CNN
F 2 "" H 6450 2900 50  0001 C CNN
F 3 "" H 6450 2900 50  0001 C CNN
	1    6450 2900
	0    1    1    0   
$EndComp
Wire Wire Line
	6650 3400 6650 3100
Wire Wire Line
	6650 3100 6450 3100
$Comp
L Connector:Micro_SD_Card_Det J7
U 1 1 5D04C1DF
P 5550 2800
F 0 "J7" H 5500 1983 50  0000 C CNN
F 1 "Micro_SD_Card_Det" H 5500 2074 50  0000 C CNN
F 2 "Connector_Card:microSD_HC_Hirose_DM3BT-DSF-PEJS" H 7600 3500 50  0001 C CNN
F 3 "https://www.hirose.com/product/en/download_file/key_name/DM3/category/Catalog/doc_file_id/49662/?file_category_id=4&item_id=195&is_series=1" H 5550 2900 50  0001 C CNN
F 4 "DM3BT-DSF-PEJS" H 5550 2800 50  0001 C CNN "Part Number"
	1    5550 2800
	-1   0    0    1   
$EndComp
Wire Wire Line
	6450 3000 7500 3000
Wire Wire Line
	7500 3000 7500 2700
$Comp
L power:GND #PWR03
U 1 1 5D063ECD
P 6450 2400
F 0 "#PWR03" H 6450 2150 50  0001 C CNN
F 1 "GND" V 6455 2272 50  0000 R CNN
F 2 "" H 6450 2400 50  0001 C CNN
F 3 "" H 6450 2400 50  0001 C CNN
	1    6450 2400
	0    -1   -1   0   
$EndComp
NoConn ~ 8250 2400
NoConn ~ 8250 2300
NoConn ~ 6450 2500
NoConn ~ 6450 3200
NoConn ~ 7700 4350
NoConn ~ 7700 4550
$Comp
L Connector_Generic:Conn_01x02 J8
U 1 1 5D083007
P 5550 7000
F 0 "J8" H 5630 6900 50  0000 L CNN
F 1 "5V In" H 5630 6991 50  0000 L CNN
F 2 "Connector_JST:JST_XH_B2B-XH-A_1x02_P2.50mm_Vertical" H 5550 7000 50  0001 C CNN
F 3 "~" H 5550 7000 50  0001 C CNN
F 4 "B2B-XH-A" H 5550 7000 50  0001 C CNN "Part Number"
	1    5550 7000
	-1   0    0    1   
$EndComp
$Comp
L power:GND #PWR05
U 1 1 5D0843E9
P 5750 7000
F 0 "#PWR05" H 5750 6750 50  0001 C CNN
F 1 "GND" H 5755 6827 50  0000 C CNN
F 2 "" H 5750 7000 50  0001 C CNN
F 3 "" H 5750 7000 50  0001 C CNN
	1    5750 7000
	1    0    0    -1  
$EndComp
$Comp
L power:+5V #PWR04
U 1 1 5D086D34
P 5750 6900
F 0 "#PWR04" H 5750 6750 50  0001 C CNN
F 1 "+5V" H 5765 7073 50  0000 C CNN
F 2 "" H 5750 6900 50  0001 C CNN
F 3 "" H 5750 6900 50  0001 C CNN
	1    5750 6900
	1    0    0    -1  
$EndComp
Text Label 7850 2800 0    50   ~ 0
SD_DET
$Comp
L power:GND #PWR0119
U 1 1 5D0BB110
P 4600 2300
F 0 "#PWR0119" H 4600 2050 50  0001 C CNN
F 1 "GND" V 4605 2172 50  0000 R CNN
F 2 "" H 4600 2300 50  0001 C CNN
F 3 "" H 4600 2300 50  0001 C CNN
	1    4600 2300
	1    0    0    -1  
$EndComp
Wire Wire Line
	4600 2300 4750 2300
$Comp
L Device:R R1
U 1 1 5D165BB6
P 3450 6850
F 0 "R1" V 3657 6850 50  0000 C CNN
F 1 "15K" V 3566 6850 50  0000 C CNN
F 2 "Resistor_SMD:R_0603_1608Metric_Pad1.05x0.95mm_HandSolder" V 3380 6850 50  0001 C CNN
F 3 "~" H 3450 6850 50  0001 C CNN
F 4 "RC0603FR-0715KL" H 3450 6850 50  0001 C CNN "Part Number"
	1    3450 6850
	0    -1   -1   0   
$EndComp
$Comp
L Device:R R2
U 1 1 5D1660E0
P 3700 7100
F 0 "R2" H 3770 7146 50  0000 L CNN
F 1 "47K" H 3770 7055 50  0000 L CNN
F 2 "Resistor_SMD:R_0603_1608Metric_Pad1.05x0.95mm_HandSolder" V 3630 7100 50  0001 C CNN
F 3 "~" H 3700 7100 50  0001 C CNN
F 4 "CRCW060347K0FKEAC" H 3700 7100 50  0001 C CNN "Part Number"
	1    3700 7100
	1    0    0    -1  
$EndComp
Wire Wire Line
	3700 5850 3100 5850
$Comp
L power:GND #PWR0120
U 1 1 5D1702CA
P 3700 7300
F 0 "#PWR0120" H 3700 7050 50  0001 C CNN
F 1 "GND" H 3705 7127 50  0000 C CNN
F 2 "" H 3700 7300 50  0001 C CNN
F 3 "" H 3700 7300 50  0001 C CNN
	1    3700 7300
	1    0    0    -1  
$EndComp
Wire Wire Line
	3600 6850 3700 6850
Wire Wire Line
	3700 7250 3700 7300
Connection ~ 3700 6850
Wire Wire Line
	3700 6850 3700 6950
Wire Wire Line
	1850 5750 2200 5750
Wire Wire Line
	3700 5850 3700 6850
$Comp
L Connector_Generic:Conn_01x01 J9
U 1 1 5D18C84B
P 3050 6850
F 0 "J9" H 2968 6625 50  0000 C CNN
F 1 "Bat V" H 2968 6716 50  0000 C CNN
F 2 "Connector_PinHeader_2.54mm:PinHeader_1x01_P2.54mm_Vertical" H 3050 6850 50  0001 C CNN
F 3 "~" H 3050 6850 50  0001 C CNN
	1    3050 6850
	-1   0    0    1   
$EndComp
Wire Wire Line
	3250 6850 3300 6850
Wire Wire Line
	7400 3500 7400 2800
Wire Wire Line
	6450 2800 7400 2800
$Comp
L Device:LED D2
U 1 1 5D29927C
P 1300 4500
F 0 "D2" V 1339 4383 50  0000 R CNN
F 1 "Sn" V 1248 4383 50  0000 R CNN
F 2 "LED_SMD:LED_0603_1608Metric_Pad1.05x0.95mm_HandSolder" H 1300 4500 50  0001 C CNN
F 3 "~" H 1300 4500 50  0001 C CNN
F 4 "150060VS75000" H 1300 4500 50  0001 C CNN "Part Number"
	1    1300 4500
	0    -1   -1   0   
$EndComp
$Comp
L Device:LED D3
U 1 1 5D299E8B
P 1600 4500
F 0 "D3" V 1639 4383 50  0000 R CNN
F 1 "Dt" V 1548 4383 50  0000 R CNN
F 2 "LED_SMD:LED_0603_1608Metric_Pad1.05x0.95mm_HandSolder" H 1600 4500 50  0001 C CNN
F 3 "~" H 1600 4500 50  0001 C CNN
F 4 "150060BS75000" H 1600 4500 50  0001 C CNN "Part Number"
	1    1600 4500
	0    -1   -1   0   
$EndComp
$Comp
L Device:R R5
U 1 1 5D2CCB95
P 1750 4250
F 0 "R5" V 1850 4250 50  0000 C CNN
F 1 "510" V 1750 4250 50  0000 C CNN
F 2 "Resistor_SMD:R_0603_1608Metric_Pad1.05x0.95mm_HandSolder" V 1680 4250 50  0001 C CNN
F 3 "~" H 1750 4250 50  0001 C CNN
F 4 "CR0603-FX-5100ELF" H 1750 4250 50  0001 C CNN "Part Number"
	1    1750 4250
	0    1    1    0   
$EndComp
$Comp
L Device:R R4
U 1 1 5D2CCF82
P 1750 4150
F 0 "R4" V 1650 4150 50  0000 C CNN
F 1 "510" V 1750 4150 50  0000 C CNN
F 2 "Resistor_SMD:R_0603_1608Metric_Pad1.05x0.95mm_HandSolder" V 1680 4150 50  0001 C CNN
F 3 "~" H 1750 4150 50  0001 C CNN
F 4 "CR0603-FX-5100ELF" H 1750 4150 50  0001 C CNN "Part Number"
	1    1750 4150
	0    1    1    0   
$EndComp
$Comp
L power:GND #PWR06
U 1 1 5D2CD8A4
P 1150 4750
F 0 "#PWR06" H 1150 4500 50  0001 C CNN
F 1 "GND" H 1155 4577 50  0000 C CNN
F 2 "" H 1150 4750 50  0001 C CNN
F 3 "" H 1150 4750 50  0001 C CNN
	1    1150 4750
	1    0    0    -1  
$EndComp
$Comp
L power:GND #PWR07
U 1 1 5D2CDEA2
P 1300 4750
F 0 "#PWR07" H 1300 4500 50  0001 C CNN
F 1 "GND" H 1305 4577 50  0000 C CNN
F 2 "" H 1300 4750 50  0001 C CNN
F 3 "" H 1300 4750 50  0001 C CNN
	1    1300 4750
	1    0    0    -1  
$EndComp
$Comp
L power:GND #PWR08
U 1 1 5D2CDFAA
P 1600 4750
F 0 "#PWR08" H 1600 4500 50  0001 C CNN
F 1 "GND" H 1605 4577 50  0000 C CNN
F 2 "" H 1600 4750 50  0001 C CNN
F 3 "" H 1600 4750 50  0001 C CNN
	1    1600 4750
	1    0    0    -1  
$EndComp
Wire Wire Line
	1150 3850 1150 4350
Wire Wire Line
	1150 4650 1150 4750
Wire Wire Line
	1600 3850 1150 3850
Wire Wire Line
	1300 4150 1300 4350
Wire Wire Line
	1300 4650 1300 4750
Wire Wire Line
	1600 4150 1300 4150
Wire Wire Line
	1600 4750 1600 4650
Wire Wire Line
	1600 4350 1600 4250
NoConn ~ 9150 2300
NoConn ~ 9150 2400
NoConn ~ 9150 2500
NoConn ~ 9150 2600
NoConn ~ 9150 2700
NoConn ~ 9150 2800
NoConn ~ 9150 2900
NoConn ~ 8250 3700
NoConn ~ 8250 3800
NoConn ~ 8250 3200
NoConn ~ 8250 3100
NoConn ~ 6500 4550
NoConn ~ 6500 4750
NoConn ~ 6500 4850
NoConn ~ 6500 4950
NoConn ~ 6500 5050
NoConn ~ 6500 5150
NoConn ~ 6500 5250
NoConn ~ 7700 5150
NoConn ~ 7700 4950
NoConn ~ 7700 4850
NoConn ~ 7700 4750
NoConn ~ 7700 4650
NoConn ~ 2200 5250
NoConn ~ 2200 5950
NoConn ~ 2200 5850
NoConn ~ 2200 5650
NoConn ~ 2200 5550
NoConn ~ 3100 5350
NoConn ~ 3100 5250
NoConn ~ 2200 5150
NoConn ~ 2200 5050
NoConn ~ 2200 4950
NoConn ~ 2200 4850
NoConn ~ 2200 4750
NoConn ~ 3100 4750
NoConn ~ 3100 4650
NoConn ~ 3100 4550
NoConn ~ 3100 4450
NoConn ~ 3100 4250
NoConn ~ 2200 4350
NoConn ~ 2200 4450
NoConn ~ 2200 4550
NoConn ~ 2200 4650
NoConn ~ 10150 4350
NoConn ~ 10150 4450
$Comp
L power:PWR_FLAG #FLG0101
U 1 1 5D3C1C2F
P 5750 6900
F 0 "#FLG0101" H 5750 6975 50  0001 C CNN
F 1 "PWR_FLAG" V 5750 7028 50  0000 L CNN
F 2 "" H 5750 6900 50  0001 C CNN
F 3 "~" H 5750 6900 50  0001 C CNN
	1    5750 6900
	0    1    1    0   
$EndComp
Connection ~ 5750 6900
NoConn ~ 3100 4950
$Comp
L power:+3.3V #PWR0121
U 1 1 5D3CA09F
P 5750 6200
F 0 "#PWR0121" H 5750 6050 50  0001 C CNN
F 1 "+3.3V" H 5765 6373 50  0000 C CNN
F 2 "" H 5750 6200 50  0001 C CNN
F 3 "" H 5750 6200 50  0001 C CNN
	1    5750 6200
	1    0    0    -1  
$EndComp
$Comp
L power:PWR_FLAG #FLG0102
U 1 1 5D3CAF9A
P 5750 6200
F 0 "#FLG0102" H 5750 6275 50  0001 C CNN
F 1 "PWR_FLAG" H 5750 6373 50  0000 C CNN
F 2 "" H 5750 6200 50  0001 C CNN
F 3 "~" H 5750 6200 50  0001 C CNN
	1    5750 6200
	-1   0    0    1   
$EndComp
$Comp
L power:GND #PWR0122
U 1 1 5D3CBFC4
P 6150 6250
F 0 "#PWR0122" H 6150 6000 50  0001 C CNN
F 1 "GND" H 6155 6077 50  0000 C CNN
F 2 "" H 6150 6250 50  0001 C CNN
F 3 "" H 6150 6250 50  0001 C CNN
	1    6150 6250
	1    0    0    -1  
$EndComp
$Comp
L power:PWR_FLAG #FLG0103
U 1 1 5D3CC763
P 6150 6250
F 0 "#FLG0103" H 6150 6325 50  0001 C CNN
F 1 "PWR_FLAG" H 6150 6423 50  0000 C CNN
F 2 "" H 6150 6250 50  0001 C CNN
F 3 "~" H 6150 6250 50  0001 C CNN
	1    6150 6250
	1    0    0    -1  
$EndComp
Wire Wire Line
	9500 2100 9500 2350
Wire Wire Line
	9500 2350 10450 2350
Text Label 10050 2350 0    50   ~ 0
GPS_EN
Wire Wire Line
	9300 4350 9300 3300
Wire Wire Line
	9200 3400 9200 4450
Wire Wire Line
	9200 4450 9650 4450
Wire Wire Line
	10350 2650 10450 2650
$Comp
L power:+3.3V #PWR0123
U 1 1 5DC259C6
P 10300 2150
F 0 "#PWR0123" H 10300 2000 50  0001 C CNN
F 1 "+3.3V" H 10315 2323 50  0000 C CNN
F 2 "" H 10300 2150 50  0001 C CNN
F 3 "" H 10300 2150 50  0001 C CNN
	1    10300 2150
	1    0    0    -1  
$EndComp
Wire Wire Line
	10300 2150 10450 2150
Text Label 10450 2250 2    50   ~ 0
GPS_PWR_STA
Text Label 8250 2900 2    50   ~ 0
GPS_PWR_STA
Wire Wire Line
	7750 2200 8250 2200
Wire Wire Line
	7850 2100 8250 2100
Wire Wire Line
	8050 3000 8250 3000
Wire Wire Line
	8200 3600 8250 3600
Wire Wire Line
	9150 2200 9400 2200
Wire Wire Line
	9150 3600 9850 3600
Wire Wire Line
	7500 2700 8250 2700
Wire Wire Line
	6650 3400 8250 3400
Wire Wire Line
	7600 2800 8250 2800
Wire Wire Line
	6450 2600 8250 2600
Wire Wire Line
	9150 2100 9500 2100
Wire Wire Line
	9150 3400 9200 3400
Wire Wire Line
	9150 3300 9300 3300
Wire Wire Line
	9150 3100 9750 3100
Wire Wire Line
	9750 1500 9750 3100
Wire Wire Line
	9150 3000 9650 3000
Wire Wire Line
	9650 1200 9650 3000
NoConn ~ 9150 3800
NoConn ~ 9150 3700
NoConn ~ 9150 3500
NoConn ~ 9150 3200
$Comp
L emission:NUCLEO64-F091 CN10
U 2 1 5CF36447
P 8700 2900
F 0 "CN10" H 8750 4017 50  0000 C CNN
F 1 "2x19" H 8750 3926 50  0000 C CNN
F 2 "Connector_PinSocket_2.54mm:PinSocket_2x19_P2.54mm_Vertical" H 8700 2900 50  0001 C CNN
F 3 "~" H 8700 2900 50  0001 C CNN
	2    8700 2900
	1    0    0    -1  
$EndComp
Text Label 10100 1400 2    50   ~ 0
PMS_TX
Wire Wire Line
	9150 1300 9150 2000
Wire Wire Line
	10100 1300 9150 1300
Wire Wire Line
	8250 1400 10100 1400
Wire Wire Line
	8250 1400 8250 2000
Wire Wire Line
	7400 3500 8250 3500
NoConn ~ 8250 2500
$Comp
L Device:R R6
U 1 1 5DCB79D2
P 8000 5200
F 0 "R6" H 8070 5246 50  0000 L CNN
F 1 "10k" H 8070 5155 50  0000 L CNN
F 2 "Resistor_SMD:R_0603_1608Metric_Pad1.05x0.95mm_HandSolder" V 7930 5200 50  0001 C CNN
F 3 "~" H 8000 5200 50  0001 C CNN
F 4 "RT0603FRE0710KL" H 8000 5200 50  0001 C CNN "Part Number"
	1    8000 5200
	1    0    0    -1  
$EndComp
$Comp
L RF_Module:ESP-12E U1
U 1 1 5CFAE450
P 7100 4750
F 0 "U1" H 7300 5650 50  0000 C CNN
F 1 "ESP-12E" H 7400 5550 50  0000 C CNN
F 2 "RF_Module:ESP-12E" H 7100 4750 50  0001 C CNN
F 3 "http://wiki.ai-thinker.com/_media/esp8266/esp8266_series_modules_user_manual_v1.1.pdf" H 6750 4850 50  0001 C CNN
F 4 "ESP-12E" H 7100 4750 50  0001 C CNN "Part Number"
	1    7100 4750
	1    0    0    -1  
$EndComp
$Comp
L power:GND #PWR0124
U 1 1 5DCBA811
P 8000 5450
F 0 "#PWR0124" H 8000 5200 50  0001 C CNN
F 1 "GND" H 8005 5277 50  0000 C CNN
F 2 "" H 8000 5450 50  0001 C CNN
F 3 "" H 8000 5450 50  0001 C CNN
	1    8000 5450
	1    0    0    -1  
$EndComp
Wire Wire Line
	7700 5050 8000 5050
Wire Wire Line
	8000 5350 8000 5450
$Comp
L Device:LED D1
U 1 1 5D299762
P 1150 4500
F 0 "D1" V 1189 4579 50  0000 L CNN
F 1 "Er" V 1098 4579 50  0000 L CNN
F 2 "LED_SMD:LED_0603_1608Metric_Pad1.05x0.95mm_HandSolder" H 1150 4500 50  0001 C CNN
F 3 "~" H 1150 4500 50  0001 C CNN
F 4 "150060RS75000" H 1150 4500 50  0001 C CNN "Part Number"
	1    1150 4500
	0    -1   -1   0   
$EndComp
Wire Wire Line
	7700 4150 7900 4150
Connection ~ 3100 5050
NoConn ~ 2200 5350
NoConn ~ 2200 5450
Wire Wire Line
	1900 4250 2200 4250
Wire Wire Line
	2200 4150 1900 4150
Wire Wire Line
	3100 4150 3200 4150
Wire Wire Line
	3200 4150 3200 3850
$Comp
L Device:R R3
U 1 1 5D2CCFCC
P 1750 3850
F 0 "R3" V 1650 3850 50  0000 C CNN
F 1 "510" V 1750 3850 50  0000 C CNN
F 2 "Resistor_SMD:R_0603_1608Metric_Pad1.05x0.95mm_HandSolder" V 1680 3850 50  0001 C CNN
F 3 "~" H 1750 3850 50  0001 C CNN
F 4 "CR0603-FX-5100ELF" H 1750 3850 50  0001 C CNN "Part Number"
	1    1750 3850
	0    1    1    0   
$EndComp
Wire Wire Line
	1900 3850 3200 3850
Wire Wire Line
	6450 2300 7600 2300
Wire Wire Line
	7600 2300 7600 2800
NoConn ~ 8250 3300
Text Label 7900 4150 1    50   ~ 0
ESP_FLASH
Text Label 3250 5950 0    50   ~ 0
ESP_FLASH
Wire Wire Line
	3100 5950 3250 5950
$EndSCHEMATC
