{
    "a": {
        "Probabilidad de bloqueo": 0.138932,
        "Confidence interval 1": [
            0.13773,
            0.140134
        ],
        "Confidence interval 2": [
            0.137542,
            0.140321
        ]
    },
    "b": {
        "Probabilidad de bloqueo": 0.181452,
        "Confidence interval 1": [
            0.180061,
            0.182843
        ],
        "Confidence interval 2": [
            0.179638,
            0.183267
        ]
    },
    "c": {
        "Probabilidad de bloqueo": 0.139168,
        "Confidence interval 1": [
            0.137867,
            0.140469
        ],
        "Confidence interval 2": [
            0.137776,
            0.14056
        ]
    },
    "d": {
        "Probabilidad de bloqueo": 0.181936,
        "Confidence interval 1": [
            0.18058,
            0.183292
        ],
        "Confidence interval 2": [
            0.180117,
            0.183755
        ]
    }
}