Semilla: 1
Tolerancia relativa: 0.01

Trafico/s promediado/s en a:
Probabilidad de bloqueo estimada: 0.346419
	Confidence interval 1: (0.343225,0.349613) with coverage: 0.95
	Confidence interval 2: (0.342955,0.349883) with coverage: 0.965602
	Number of samples: 229537
	Variance: 0.226414
	Standard deviation: 0.47583
	Maximum sample: 1
	Minimum sample: 0

Trafico/s promediado/s en b:
Probabilidad de bloqueo estimada: 0.368308
	Confidence interval 1: (0.365644,0.370972) with coverage: 0.95
	Confidence interval 2: (0.364625,0.371991) with coverage: 0.994039
	Number of samples: 229680
	Variance: 0.232658
	Standard deviation: 0.482347
	Maximum sample: 1
	Minimum sample: 0

Trafico/s promediado/s en c:
Probabilidad de bloqueo estimada: 0.34683
	Confidence interval 1: (0.34356,0.3501) with coverage: 0.95
	Confidence interval 2: (0.343362,0.350298) with coverage: 0.96177
	Number of samples: 115584
	Variance: 0.226541
	Standard deviation: 0.475963
	Maximum sample: 1
	Minimum sample: 0

Trafico/s promediado/s en d:
Probabilidad de bloqueo estimada: 0.368325
	Confidence interval 1: (0.365869,0.370782) with coverage: 0.95
	Confidence interval 2: (0.364642,0.372009) with coverage: 0.997689
	Number of samples: 230329
	Variance: 0.232663
	Standard deviation: 0.482351
	Maximum sample: 1
	Minimum sample: 0

0.358989
	Confidence interval 1: (0.356805,0.361173) with coverage: 0.95
	Confidence interval 2: (0.355399,0.362579) with coverage: 0.998274
	Number of samples: 805130
	Variance: 0.230116
	Standard deviation: 0.479704
	Maximum sample: 1
	Minimum sample: 0
