Semilla: 1
Tolerancia relativa: 0.01

Trafico/s promediado/s en a:
Probabilidad de bloqueo estimada: 0.229788
	Confidence interval 1: (0.228116,0.231459) with coverage: 0.95
	Confidence interval 2: (0.22749,0.232085) with coverage: 0.993665
	Number of samples: 523266
	Variance: 0.176986
	Standard deviation: 0.420697
	Maximum sample: 1
	Minimum sample: 0

Trafico/s promediado/s en b:
Probabilidad de bloqueo estimada: 0.444439
	Confidence interval 1: (0.442584,0.446293) with coverage: 0.95
	Confidence interval 2: (0.439994,0.448883) with coverage: 1
	Number of samples: 524095
	Variance: 0.246913
	Standard deviation: 0.496904
	Maximum sample: 1
	Minimum sample: 0

Trafico/s promediado/s en c:
Probabilidad de bloqueo estimada: 0.230074
	Confidence interval 1: (0.228099,0.232049) with coverage: 0.95
	Confidence interval 2: (0.227773,0.232374) with coverage: 0.97645
	Number of samples: 262303
	Variance: 0.17714
	Standard deviation: 0.420881
	Maximum sample: 1
	Minimum sample: 0

Trafico/s promediado/s en d:
Probabilidad de bloqueo estimada: 0.446227
	Confidence interval 1: (0.444141,0.448313) with coverage: 0.95
	Confidence interval 2: (0.441765,0.450689) with coverage: 0.999919
	Number of samples: 523964
	Variance: 0.247109
	Standard deviation: 0.497101
	Maximum sample: 1
	Minimum sample: 0

0.353029
	Confidence interval 1: (0.351458,0.3546) with coverage: 0.95
	Confidence interval 2: (0.349499,0.356559) with coverage: 0.999967
	Number of samples: 1833628
	Variance: 0.2284
	Standard deviation: 0.477912
	Maximum sample: 1
	Minimum sample: 0
