Semilla: 1
Tolerancia relativa: 0.01

Trafico/s promediado/s en a:
Probabilidad de bloqueo estimada: 0.420039
	Confidence interval 1: (0.416793,0.423284) with coverage: 0.95
	Confidence interval 2: (0.415838,0.424239) with coverage: 0.987405
	Number of samples: 146127
	Variance: 0.243608
	Standard deviation: 0.493566
	Maximum sample: 1
	Minimum sample: 0

Trafico/s promediado/s en b:
Probabilidad de bloqueo estimada: 0.435494
	Confidence interval 1: (0.431904,0.439084) with coverage: 0.95
	Confidence interval 2: (0.431139,0.439849) with coverage: 0.981101
	Number of samples: 146165
	Variance: 0.245841
	Standard deviation: 0.495823
	Maximum sample: 1
	Minimum sample: 0

Trafico/s promediado/s en c:
Probabilidad de bloqueo estimada: 0.421583
	Confidence interval 1: (0.417961,0.425205) with coverage: 0.95
	Confidence interval 2: (0.417367,0.425799) with coverage: 0.976224
	Number of samples: 73511
	Variance: 0.243854
	Standard deviation: 0.493816
	Maximum sample: 1
	Minimum sample: 0

Trafico/s promediado/s en d:
Probabilidad de bloqueo estimada: 0.433307
	Confidence interval 1: (0.430675,0.435939) with coverage: 0.95
	Confidence interval 2: (0.428973,0.43764) with coverage: 0.998293
	Number of samples: 146686
	Variance: 0.245554
	Standard deviation: 0.495534
	Maximum sample: 1
	Minimum sample: 0

0.428466
	Confidence interval 1: (0.426072,0.430859) with coverage: 0.95
	Confidence interval 2: (0.424181,0.43275) with coverage: 0.999364
	Number of samples: 512489
	Variance: 0.244883
	Standard deviation: 0.494857
	Maximum sample: 1
	Minimum sample: 0
