{
    "a": {
        "Probabilidad de bloqueo": 0.223902,
        "Confidence interval 1": [
            0.222095,
            0.225709
        ],
        "Confidence interval 2": [
            0.221663,
            0.226141
        ]
    },
    "b": {
        "Probabilidad de bloqueo": 0.223758,
        "Confidence interval 1": [
            0.221655,
            0.225862
        ],
        "Confidence interval 2": [
            0.221521,
            0.225996
        ]
    },
    "c": {
        "Probabilidad de bloqueo": 0.22481,
        "Confidence interval 1": [
            0.222668,
            0.226953
        ],
        "Confidence interval 2": [
            0.222562,
            0.227058
        ]
    },
    "d": {
        "Probabilidad de bloqueo": 0.22462,
        "Confidence interval 1": [
            0.222518,
            0.226722
        ],
        "Confidence interval 2": [
            0.222374,
            0.226866
        ]
    }
}