{
    "a": {
        "Probabilidad de bloqueo": 0.110061,
        "Confidence interval 1": [
            0.109353,
            0.110768
        ],
        "Confidence interval 2": [
            0.10896,
            0.111162
        ]
    },
    "b": {
        "Probabilidad de bloqueo": 0.287514,
        "Confidence interval 1": [
            0.286153,
            0.288876
        ],
        "Confidence interval 2": [
            0.284639,
            0.290389
        ]
    },
    "c": {
        "Probabilidad de bloqueo": 0.111212,
        "Confidence interval 1": [
            0.11014,
            0.112283
        ],
        "Confidence interval 2": [
            0.110099,
            0.112324
        ]
    },
    "d": {
        "Probabilidad de bloqueo": 0.288353,
        "Confidence interval 1": [
            0.287196,
            0.289509
        ],
        "Confidence interval 2": [
            0.285469,
            0.291236
        ]
    }
}