* source PRACTICA7_1
V_V1         VI 0 10Vdc
Q_Q1         N00382 N00402 VI QbreakP 
R_R1         N00406 N00402  330 TC=0,0 
R_R2         N00410 N00414  10k TC=0,0 
R_R3         VO 0  10 TC=0,0 
Q_Q2         N00406 N00410 0 QbreakN 
D_D1         0 N00382 Dbreak 
L_L1         N00382 VO  100uH  
C_C1         0 VO  100uF  TC=0,0 
V_V2         N00414 0  
+PULSE 0V 10V 0 1ns 1ns 5us 20us
