
**** 03/20/23 18:18:24 ******* PSpice Lite (March 2016) ******* ID# 10813 ****

 ** Profile: "SCHEMATIC1-P4_1"  [ C:\Users\juanc\Desktop\Teleco\TE\Practica4\Practica4_1-PSpiceFiles\SCHEMATIC1\P4_1.sim ] 


 ****     CIRCUIT DESCRIPTION


******************************************************************************




** Creating circuit file "P4_1.cir" 
** WARNING: THIS AUTOMATICALLY GENERATED FILE MAY BE OVERWRITTEN BY SUBSEQUENT SIMULATIONS

*Libraries: 
* Profile Libraries :
* Local Libraries :
* From [PSPICE NETLIST] section of C:\SPB_Data\cdssetup\OrCAD_PSpice\17.2.0\PSpice.ini file:
.lib "nomd.lib" 

*Analysis directives: 
.TRAN  0 100ms 0 100us 
.OPTIONS ADVCONV
.PROBE64 V(alias(*)) I(alias(*)) W(alias(*)) D(alias(*)) NOISE(alias(*)) 
.INC "..\SCHEMATIC1.net" 



**** INCLUDING SCHEMATIC1.net ****
* source PRACTICA4_1
X_U1         N00204 N00215 VCC -VCC N00211 uA741
V_V1         VCC 0 12Vdc
V_V2         0 -VCC 12Vdc
D_D1         N00211 N00215 D1N4148_1 
R_R1         0 N00215  1k TC=0,0 
V_V3         N00204 0  
+SIN 0 1 100 0 0 0

**** RESUMING P4_1.cir ****
.END

**** 03/20/23 18:18:24 ******* PSpice Lite (March 2016) ******* ID# 10813 ****

 ** Profile: "SCHEMATIC1-P4_1"  [ C:\Users\juanc\Desktop\Teleco\TE\Practica4\Practica4_1-PSpiceFiles\SCHEMATIC1\P4_1.sim ] 


 ****     Diode MODEL PARAMETERS


******************************************************************************




               D1N4148_1       X_U1.dx         X_U1.dy         
          IS    2.682000E-09  800.000000E-18  800.000000E-18 
           N    1.836                                        
         ISR    1.565000E-09                                 
         IKF     .04417                                      
          BV  100                                            
         IBV  100.000000E-06                                 
          RS     .5664          1               1.000000E-03 
          TT   11.540000E-09                                 
         CJO    4.000000E-12                   10.000000E-12 
          VJ     .5                                          
           M     .3333                                       


**** 03/20/23 18:18:24 ******* PSpice Lite (March 2016) ******* ID# 10813 ****

 ** Profile: "SCHEMATIC1-P4_1"  [ C:\Users\juanc\Desktop\Teleco\TE\Practica4\Practica4_1-PSpiceFiles\SCHEMATIC1\P4_1.sim ] 


 ****     BJT MODEL PARAMETERS


******************************************************************************




               X_U1.qx         
               NPN             
       LEVEL    1            
          IS  800.000000E-18 
          BF   93.75         
          NF    1            
          BR    1            
          NR    1            
         ISS    0            
          RE    0            
          RC    0            
         CJE    0            
         VJE     .75         
         CJC    0            
         VJC     .75         
         MJC     .33         
        XCJC    1            
         CJS    0            
         VJS     .75         
          KF    0            
          AF    1            
          CN    2.42         
           D     .87         


**** 03/20/23 18:18:24 ******* PSpice Lite (March 2016) ******* ID# 10813 ****

 ** Profile: "SCHEMATIC1-P4_1"  [ C:\Users\juanc\Desktop\Teleco\TE\Practica4\Practica4_1-PSpiceFiles\SCHEMATIC1\P4_1.sim ] 


 ****     INITIAL TRANSIENT SOLUTION       TEMPERATURE =   27.000 DEG C


******************************************************************************



 NODE   VOLTAGE     NODE   VOLTAGE     NODE   VOLTAGE     NODE   VOLTAGE


(  VCC)   12.0000  ( -VCC)  -12.0000  (N00204)    0.0000 (N00211)     .1572     

(N00215) 18.46E-06 (X_U1.6)-14.82E-06 (X_U1.7)     .1572 (X_U1.8)     .1572     

(X_U1.9)    0.0000 (X_U1.10)    -.6077                   (X_U1.11)   11.9600    

(X_U1.12)   11.9600                   (X_U1.13)    -.5938                       

(X_U1.14)    -.5938                   (X_U1.53)   11.0000                       

(X_U1.54)  -11.0000                   (X_U1.90) 98.23E-06                       

(X_U1.91)   40.0000                   (X_U1.92)  -40.0000                       

(X_U1.99)    0.0000                   




    VOLTAGE SOURCE CURRENTS
    NAME         CURRENT

    V_V1        -1.337E-03
    V_V2        -1.337E-03
    V_V3        -7.973E-08
    X_U1.vb     -1.482E-10
    X_U1.vc      1.084E-11
    X_U1.ve      1.266E-11
    X_U1.vlim    9.823E-08
    X_U1.vlp    -4.000E-11
    X_U1.vln    -4.000E-11

    TOTAL POWER DISSIPATION   3.21E-02  WATTS



          JOB CONCLUDED

**** 03/20/23 18:18:24 ******* PSpice Lite (March 2016) ******* ID# 10813 ****

 ** Profile: "SCHEMATIC1-P4_1"  [ C:\Users\juanc\Desktop\Teleco\TE\Practica4\Practica4_1-PSpiceFiles\SCHEMATIC1\P4_1.sim ] 


 ****     JOB STATISTICS SUMMARY


******************************************************************************



  Total job time (using Solver 1)   =         .14
