
**** 03/20/23 16:36:55 ******* PSpice Lite (March 2016) ******* ID# 10813 ****

 ** Profile: "SCHEMATIC1-Ej1"  [ C:\Users\juanc\Desktop\Teleco\TE\Practica2\Practica2-PSpiceFiles\SCHEMATIC1\Ej1.sim ] 


 ****     CIRCUIT DESCRIPTION


******************************************************************************




** Creating circuit file "Ej1.cir" 
** WARNING: THIS AUTOMATICALLY GENERATED FILE MAY BE OVERWRITTEN BY SUBSEQUENT SIMULATIONS

*Libraries: 
* Profile Libraries :
* Local Libraries :
* From [PSPICE NETLIST] section of C:\SPB_Data\cdssetup\OrCAD_PSpice\17.2.0\PSpice.ini file:
.lib "nomd.lib" 

*Analysis directives: 
.TRAN  0 5ms 0 5us 
.OPTIONS ADVCONV
.PROBE64 V(alias(*)) I(alias(*)) W(alias(*)) D(alias(*)) NOISE(alias(*)) 
.INC "..\SCHEMATIC1.net" 



**** INCLUDING SCHEMATIC1.net ****
* source PRACTICA2
Q_Q1         N00260 N00232 N000402 PN2222A
R_R1         N00260 VCC  1.8k TC=0,0 
R_R2         0 N000402  470 TC=0,0 
R_R3         0 N00232  4.7k TC=0,0 
R_R4         N00232 VCC  18k TC=0,0 
V_V1         VCC 0 10Vdc

**** RESUMING Ej1.cir ****
.END

**** 03/20/23 16:36:55 ******* PSpice Lite (March 2016) ******* ID# 10813 ****

 ** Profile: "SCHEMATIC1-Ej1"  [ C:\Users\juanc\Desktop\Teleco\TE\Practica2\Practica2-PSpiceFiles\SCHEMATIC1\Ej1.sim ] 


 ****     BJT MODEL PARAMETERS


******************************************************************************




               PN2222A         
               NPN             
       LEVEL    1            
          IS   14.340000E-15 
          BF  255.9          
          NF    1            
         VAF   74.03         
         IKF     .2847       
         ISE   14.340000E-15 
          NE    1.307        
          BR    6.092        
          NR    1            
         ISS    0            
          RB   10            
          RE    0            
          RC    1            
         CJE   22.010000E-12 
         VJE     .75         
         MJE     .377        
         CJC    7.306000E-12 
         VJC     .75         
         MJC     .3416       
        XCJC    1            
         CJS    0            
         VJS     .75         
          TF  411.100000E-12 
         XTF    3            
         VTF    1.7          
         ITF     .6          
          TR   46.910000E-09 
         XTB    1.5          
          KF    0            
          AF    1            
          CN    2.42         
           D     .87         


**** 03/20/23 16:36:55 ******* PSpice Lite (March 2016) ******* ID# 10813 ****

 ** Profile: "SCHEMATIC1-Ej1"  [ C:\Users\juanc\Desktop\Teleco\TE\Practica2\Practica2-PSpiceFiles\SCHEMATIC1\Ej1.sim ] 


 ****     INITIAL TRANSIENT SOLUTION       TEMPERATURE =   27.000 DEG C


******************************************************************************



 NODE   VOLTAGE     NODE   VOLTAGE     NODE   VOLTAGE     NODE   VOLTAGE


(  VCC)   10.0000  (N00232)    2.0076 (N00260)    4.9154 (N000402)    1.3356    




    VOLTAGE SOURCE CURRENTS
    NAME         CURRENT

    V_V1        -3.269E-03

    TOTAL POWER DISSIPATION   3.27E-02  WATTS



          JOB CONCLUDED

**** 03/20/23 16:36:55 ******* PSpice Lite (March 2016) ******* ID# 10813 ****

 ** Profile: "SCHEMATIC1-Ej1"  [ C:\Users\juanc\Desktop\Teleco\TE\Practica2\Practica2-PSpiceFiles\SCHEMATIC1\Ej1.sim ] 


 ****     JOB STATISTICS SUMMARY


******************************************************************************



  Total job time (using Solver 1)   =         .03
