Timestamp,Value
2024-01-04 20:57:10.698945,13
2024-01-04 20:57:11.701143,38
2024-01-04 20:57:12.703572,66
2024-01-04 20:57:13.705881,35
2024-01-04 20:57:14.706968,40
2024-01-04 20:57:15.708476,91
2024-01-04 20:57:16.709838,35
2024-01-04 20:57:17.711669,57
2024-01-04 20:57:18.713599,71
2024-01-04 20:57:19.715063,23
2024-01-04 20:57:20.717285,72
2024-01-04 20:57:21.719047,3
2024-01-04 20:57:22.721083,25
2024-01-04 20:57:23.722829,14
2024-01-04 20:57:24.724732,40
2024-01-04 20:57:25.726717,64
2024-01-04 20:57:26.729169,31
2024-01-04 20:57:27.731170,64
2024-01-04 20:57:28.733550,31
2024-01-04 20:57:29.734939,11
2024-01-04 20:57:30.736855,52
2024-01-04 20:57:31.738809,80
2024-01-04 20:57:32.740907,49
2024-01-04 20:57:33.742908,28
2024-01-04 20:57:34.745102,87
2024-01-04 20:57:35.746915,5
2024-01-04 20:57:36.748852,37
2024-01-04 20:57:37.750805,84
2024-01-04 20:57:38.752732,44
2024-01-04 20:57:39.755127,66
2024-01-04 20:57:40.756534,65
2024-01-04 20:57:41.758636,77
2024-01-04 20:57:42.760870,3
2024-01-04 20:57:43.762718,81
2024-01-04 20:57:44.764635,44
2024-01-04 20:57:45.766161,36
2024-01-04 20:57:46.768068,47
2024-01-04 20:57:47.770300,30
2024-01-04 20:57:48.772249,100
2024-01-04 20:57:49.773728,38
2024-01-04 20:57:50.775138,4
2024-01-04 20:57:51.777099,89
2024-01-04 20:57:52.778972,50
2024-01-04 20:57:53.780898,77
2024-01-04 20:57:54.782830,73
2024-01-04 20:57:55.785103,13
2024-01-04 20:57:56.845271,66
2024-01-04 20:57:57.846990,75
2024-01-04 20:57:58.849108,83
2024-01-04 20:57:59.851293,57
2024-01-04 21:13:14.485509,15
2024-01-04 12:58:26.535744,219
2024-01-04 12:58:26.541507,219
2024-01-04 12:58:26.548476,219
2024-01-04 12:58:26.562385,219
2024-01-04 12:58:26.883570,219
2024-01-04 12:58:27.886766,219
2024-01-04 12:58:28.971605,219
2024-01-04 12:58:29.911815,219
2024-01-04 12:58:30.929604,219
2024-01-04 12:58:31.919650,219
2024-01-04 12:58:32.938446,219
2024-01-04 12:58:33.949072,524
2024-01-04 12:58:34.962533,23
2024-01-04 12:58:36.026223,14
2024-01-04 12:58:37.015751,11
2024-01-04 12:58:38.015388,11
2024-01-04 12:58:39.031883,9
2024-01-04 12:58:40.027847,17
2024-01-04 12:58:41.059306,23
2024-01-04 12:58:42.021860,28
2024-01-04 12:58:43.048438,524
2024-01-04 12:58:44.045941,29
2024-01-04 12:58:45.065747,29
2024-01-04 12:58:46.055081,524
2024-01-04 12:58:47.071036,219
2024-01-04 12:58:48.074524,32
2024-01-04 12:58:49.081802,219
2024-01-04 12:58:50.093913,219
2024-01-04 12:58:51.089671,219
2024-01-04 12:58:52.096610,35
2024-01-04 12:58:53.117042,219
2024-01-04 12:58:54.132002,35
2024-01-04 12:58:55.469337,219
2024-01-04 12:58:56.189178,30
2024-01-04 12:58:57.152855,31
2024-01-04 12:58:58.142337,31
2024-01-04 12:58:59.168531,524
2024-01-04 12:59:00.167761,24
2024-01-04 12:59:01.169727,24
2024-01-04 12:59:02.182350,21
2024-01-04 12:59:03.180049,20
2024-01-04 12:59:04.185235,20
2024-01-04 12:59:05.194101,20
2024-01-04 12:59:06.184258,524
2024-01-04 12:59:07.212176,219
2024-01-04 12:59:08.203062,25
2024-01-04 12:59:09.232791,29
2024-01-04 12:59:10.220984,219
2024-01-04 12:59:11.233503,219
2024-01-04 12:59:12.247764,26
2024-01-04 12:59:13.252888,220
2024-01-04 12:59:14.254870,219
2024-01-04 12:59:15.250238,524
2024-01-04 12:59:16.257604,524
2024-01-04 12:59:17.265423,524
2024-01-04 12:59:18.270777,220
2024-01-04 12:59:19.270228,10
2024-01-04 12:59:20.267762,27
2024-01-04 12:59:21.297368,219
2024-01-04 12:59:22.285371,26
2024-01-04 12:59:23.312297,26
2024-01-04 12:59:24.312670,23
2024-01-04 12:59:25.316075,22
2024-01-04 12:59:26.329664,16
2024-01-04 12:59:27.340006,524
2024-01-04 12:59:28.337714,113
2024-01-04 12:59:29.357944,113
2024-01-04 12:59:30.351376,260
2024-01-04 12:59:31.371603,524
2024-01-04 12:59:32.368800,524
2024-01-04 12:59:33.380862,524
2024-01-04 12:59:34.386692,524
2024-01-04 12:59:35.390271,250
2024-01-04 12:59:36.392770,524
2024-01-04 12:59:37.407386,85
2024-01-04 12:59:38.397331,85
2024-01-04 12:59:39.413244,84
2024-01-04 12:59:40.413167,84
2024-01-04 12:59:41.431306,524
2024-01-04 12:59:42.432327,42
2024-01-04 12:59:43.439397,20
2024-01-04 12:59:44.431818,142
2024-01-04 12:59:45.454628,34
2024-01-04 12:59:46.447729,34
2024-01-04 12:59:47.472475,34
2024-01-04 12:59:48.476766,84
2024-01-04 12:59:49.478476,40
2024-01-04 12:59:50.491296,30
2024-01-04 12:59:51.493190,13
2024-01-04 12:59:52.494148,12
2024-01-04 12:59:53.496388,15
2024-01-04 12:59:54.532119,15
2024-01-04 12:59:55.512993,37
2024-01-04 12:59:56.513803,83
2024-01-04 12:59:57.511569,83
2024-01-04 12:59:58.515252,524
2024-01-04 12:59:59.526118,524
2024-01-04 13:00:00.525245,524
2024-01-04 13:00:01.536505,115
2024-01-04 13:00:02.536018,18
2024-01-04 13:00:03.549745,8
2024-01-04 13:00:04.546865,9
2024-01-04 13:00:05.577597,13
2024-01-04 13:00:06.566741,31
2024-01-04 13:00:07.584637,31
2024-01-04 13:00:08.579544,26
2024-01-04 13:00:09.591219,30
2024-01-04 13:00:10.591729,34
2024-01-04 13:00:11.605421,31
2024-01-04 13:00:12.598752,15
2024-01-04 13:00:13.612263,38
2024-01-04 13:00:14.617687,29
2024-01-04 13:00:15.628183,29
2024-01-04 13:00:16.717155,83
2024-01-04 13:00:17.723345,12
2024-01-04 13:00:18.712361,14
2024-01-04 13:00:19.724370,29
2024-01-04 13:00:20.726911,15
2024-01-04 13:00:21.725024,17
2024-01-04 13:00:22.732944,39
2024-01-04 13:00:23.733809,39
2024-01-04 13:00:24.741200,61
2024-01-04 13:00:25.749521,524
2024-01-04 13:00:26.750467,524
2024-01-04 13:00:27.757187,12
2024-01-04 13:00:28.757896,12
2024-01-04 13:00:29.780938,9
2024-01-04 13:00:30.773584,60
2024-01-04 13:00:31.792679,83
2024-01-04 13:00:32.778839,524
2024-01-04 13:00:33.800621,35
2024-01-04 13:00:34.797972,29
2024-01-04 13:00:35.814261,29
2024-01-04 13:00:36.813998,29
2024-01-04 13:00:37.823187,30
2024-01-04 13:00:38.838036,26
2024-01-04 13:00:39.830037,28
2024-01-04 13:00:40.838276,18
2024-01-04 13:00:41.828436,40
2024-01-04 13:00:42.828629,40
2024-01-04 13:00:43.855458,35
2024-01-04 13:00:44.850889,37
2024-01-04 13:00:45.862495,524
2024-01-04 13:00:46.872705,524
2024-01-04 13:00:47.873537,524
2024-01-04 13:00:48.905081,18
2024-01-04 13:00:49.890612,18
2024-01-04 13:00:50.894501,28
2024-01-04 13:00:51.904602,11
2024-01-04 13:00:52.901684,286
2024-01-04 13:00:53.911779,19
2024-01-04 13:00:54.912277,524
2024-01-04 13:00:55.928540,524
2024-01-04 13:00:56.923724,13
2024-01-04 13:00:57.936853,19
2024-01-04 13:00:58.952206,32
2024-01-04 13:00:59.966033,38
2024-01-04 13:01:00.958139,31
2024-01-04 13:01:01.953045,19
2024-01-04 13:01:02.955325,19
2024-01-04 13:01:03.985487,14
2024-01-04 13:01:04.969012,13
2024-01-04 13:01:06.001760,58
2024-01-04 13:01:06.991231,61
2024-01-04 13:01:08.003610,524
2024-01-04 13:01:09.005051,18
2024-01-04 13:01:10.022029,18
2024-01-04 13:01:11.016716,18
2024-01-04 13:01:12.018313,8
2024-01-04 13:01:13.018110,10
2024-01-04 13:01:14.039088,11
2024-01-04 13:01:15.038162,34
2024-01-04 13:01:16.045271,19
2024-01-04 13:01:17.044027,18
2024-01-04 13:01:18.050837,18
2024-01-04 13:01:19.065065,6
2024-01-04 13:01:20.067403,14
2024-01-04 13:01:21.069234,9
2024-01-04 13:01:22.065523,10
2024-01-04 13:01:23.066975,10
2024-01-04 13:01:24.083396,11
2024-01-04 13:01:25.085687,11
2024-01-04 13:01:26.097678,9
2024-01-04 13:01:27.087792,83
2024-01-04 13:01:28.116586,32
2024-01-04 13:01:29.111567,32
2024-01-04 13:01:30.124889,82
2024-01-04 13:01:31.119941,35
2024-01-04 13:01:32.137602,35
2024-01-04 13:01:33.148555,82
2024-01-04 13:01:34.151650,84
2024-01-04 13:01:35.160362,83
2024-01-04 13:01:36.163425,35
2024-01-04 13:01:37.169048,35
2024-01-04 13:01:38.172331,36
2024-01-04 13:01:39.176392,37
2024-01-04 13:01:40.194901,37
2024-01-04 13:01:41.184831,36
2024-01-04 13:01:42.212794,36
2024-01-04 13:01:43.201535,37
2024-01-04 13:01:44.226764,86
2024-01-04 13:01:45.223248,39
2024-01-04 13:01:46.232505,39
2024-01-04 13:01:47.238373,10
2024-01-04 13:01:48.252095,15
2024-01-04 13:01:49.245070,12
2024-01-04 13:01:50.251643,13
2024-01-04 13:01:51.262521,20
2024-01-04 13:01:52.277243,18
2024-01-04 13:01:53.269151,10
2024-01-04 13:01:54.279710,10
2024-01-04 13:01:55.281162,7
2024-01-04 13:01:56.301066,32
2024-01-04 13:01:57.299925,40
2024-01-04 13:01:58.312134,263
2024-01-04 13:01:59.300540,524
2024-01-04 13:02:00.327140,524
2024-01-04 13:02:01.325840,524
2024-01-04 13:02:02.342115,524
2024-01-04 13:02:03.338038,524
2024-01-04 13:02:04.349983,381
2024-01-04 13:02:05.358688,381
2024-01-04 13:02:06.370357,440
2024-01-04 13:02:07.376541,31
2024-01-04 13:02:08.380662,17
2024-01-04 13:02:09.379067,38
2024-01-04 13:02:10.394250,32
2024-01-04 13:02:11.400183,13
2024-01-04 13:02:12.410078,13
2024-01-04 13:02:13.400822,15
2024-01-04 13:02:14.412176,524
2024-01-04 13:02:15.419252,524
2024-01-04 13:02:16.429197,524
2024-01-04 13:02:17.430794,524
2024-01-04 13:02:18.426467,85
2024-01-04 13:02:19.427011,84
2024-01-04 13:02:20.448833,86
2024-01-04 13:02:21.441648,524
2024-01-04 13:02:22.446718,524
2024-01-04 13:02:23.443363,524
2024-01-04 13:02:24.459811,115
2024-01-04 13:02:25.467890,85
2024-01-04 13:02:26.479105,85
2024-01-04 13:02:27.476354,31
2024-01-04 13:02:28.475962,33
2024-01-04 13:02:29.482524,33
2024-01-04 13:02:30.495351,13
2024-01-04 13:02:31.493671,13
2024-01-04 13:02:32.495101,12
2024-01-04 13:02:33.488909,19
2024-01-04 13:02:34.521295,27
2024-01-04 13:02:35.519671,85
2024-01-04 13:02:36.523913,16
2024-01-04 13:02:37.537452,16
2024-01-04 13:02:38.533180,15
2024-01-04 13:02:39.545595,14
2024-01-04 13:02:40.552135,11
2024-01-04 13:02:41.552778,8
2024-01-04 13:02:42.563874,23
2024-01-04 13:02:43.557824,524
2024-01-04 13:02:44.577225,524
2024-01-04 13:02:45.574313,24
2024-01-04 13:02:46.595988,24
2024-01-04 13:02:47.590118,23
2024-01-04 13:02:48.606035,24
2024-01-04 13:02:49.623421,24
2024-01-04 13:02:50.620979,524
2024-01-04 13:02:51.630554,338
2024-01-04 13:02:52.632098,338
2024-01-04 13:02:53.643000,23
2024-01-04 13:02:54.640363,23
2024-01-04 13:02:55.645740,22
