{
  "bomFormat": "CycloneDX",
  "specVersion": "1.4",
  "serialNumber": "urn:uuid:0109d0d6-5b26-45fd-9cb2-729f9b0576e4",
  "version": 1,
  "metadata": {
    "timestamp": "2023-03-25T09:32:20Z",
    "tools": [
      {
        "vendor": "GitLab",
        "name": "Gemnasium",
        "version": "3.13.2"
      }
    ],
    "authors": [
      {
        "name": "GitLab",
        "email": "support@gitlab.com"
      }
    ],
    "properties": [
      {
        "name": "gitlab:dependency_scanning:input_file",
        "value": "requirements.txt"
      },
      {
        "name": "gitlab:dependency_scanning:package_manager",
        "value": "pip"
      }
    ]
  },
  "components": [
    {
      "name": "Flask",
      "version": "2.2.3",
      "purl": "pkg:pypi/Flask@2.2.3",
      "type": "library",
      "bom-ref": "pkg:pypi/Flask@2.2.3"
    },
    {
      "name": "Jinja2",
      "version": "3.1.2",
      "purl": "pkg:pypi/Jinja2@3.1.2",
      "type": "library",
      "bom-ref": "pkg:pypi/Jinja2@3.1.2"
    },
    {
      "name": "MarkupSafe",
      "version": "2.1.2",
      "purl": "pkg:pypi/MarkupSafe@2.1.2",
      "type": "library",
      "bom-ref": "pkg:pypi/MarkupSafe@2.1.2"
    },
    {
      "name": "PyYAML",
      "version": "6.0",
      "purl": "pkg:pypi/PyYAML@6.0",
      "type": "library",
      "bom-ref": "pkg:pypi/PyYAML@6.0"
    },
    {
      "name": "Werkzeug",
      "version": "2.2.3",
      "purl": "pkg:pypi/Werkzeug@2.2.3",
      "type": "library",
      "bom-ref": "pkg:pypi/Werkzeug@2.2.3"
    },
    {
      "name": "click",
      "version": "8.1.3",
      "purl": "pkg:pypi/click@8.1.3",
      "type": "library",
      "bom-ref": "pkg:pypi/click@8.1.3"
    },
    {
      "name": "importlib-metadata",
      "version": "6.1.0",
      "purl": "pkg:pypi/importlib-metadata@6.1.0",
      "type": "library",
      "bom-ref": "pkg:pypi/importlib-metadata@6.1.0"
    },
    {
      "name": "inflection",
      "version": "0.5.1",
      "purl": "pkg:pypi/inflection@0.5.1",
      "type": "library",
      "bom-ref": "pkg:pypi/inflection@0.5.1"
    },
    {
      "name": "itsdangerous",
      "version": "2.1.2",
      "purl": "pkg:pypi/itsdangerous@2.1.2",
      "type": "library",
      "bom-ref": "pkg:pypi/itsdangerous@2.1.2"
    },
    {
      "name": "sh",
      "version": "1.14.2",
      "purl": "pkg:pypi/sh@1.14.2",
      "type": "library",
      "bom-ref": "pkg:pypi/sh@1.14.2"
    },
    {
      "name": "sys-toolkit",
      "version": "2.4.5",
      "purl": "pkg:pypi/sys-toolkit@2.4.5",
      "type": "library",
      "bom-ref": "pkg:pypi/sys-toolkit@2.4.5"
    },
    {
      "name": "zipp",
      "version": "3.15.0",
      "purl": "pkg:pypi/zipp@3.15.0",
      "type": "library",
      "bom-ref": "pkg:pypi/zipp@3.15.0"
    }
  ]
}
