{
  "bomFormat": "CycloneDX",
  "specVersion": "1.4",
  "serialNumber": "urn:uuid:c7df81e7-7fc9-4326-861c-762f3c61d3a7",
  "version": 1,
  "metadata": {
    "timestamp": "2023-04-24T03:05:16Z",
    "tools": [
      {
        "vendor": "GitLab",
        "name": "Gemnasium",
        "version": "3.15.1"
      }
    ],
    "authors": [
      {
        "name": "GitLab",
        "email": "support@gitlab.com"
      }
    ],
    "properties": [
      {
        "name": "gitlab:dependency_scanning:input_file",
        "value": "requirements.txt"
      },
      {
        "name": "gitlab:dependency_scanning:input_file:path",
        "value": "requirements.txt"
      },
      {
        "name": "gitlab:dependency_scanning:package_manager",
        "value": "pip"
      },
      {
        "name": "gitlab:dependency_scanning:package_manager:name",
        "value": "pip"
      },
      {
        "name": "gitlab:meta:schema_version",
        "value": "1"
      }
    ]
  },
  "components": [
    {
      "name": "Flask",
      "version": "2.2.3",
      "purl": "pkg:pypi/Flask@2.2.3",
      "type": "library",
      "bom-ref": "pkg:pypi/Flask@2.2.3"
    },
    {
      "name": "Jinja2",
      "version": "3.1.2",
      "purl": "pkg:pypi/Jinja2@3.1.2",
      "type": "library",
      "bom-ref": "pkg:pypi/Jinja2@3.1.2"
    },
    {
      "name": "MarkupSafe",
      "version": "2.1.2",
      "purl": "pkg:pypi/MarkupSafe@2.1.2",
      "type": "library",
      "bom-ref": "pkg:pypi/MarkupSafe@2.1.2"
    },
    {
      "name": "PyYAML",
      "version": "6.0",
      "purl": "pkg:pypi/PyYAML@6.0",
      "type": "library",
      "bom-ref": "pkg:pypi/PyYAML@6.0"
    },
    {
      "name": "Werkzeug",
      "version": "2.2.3",
      "purl": "pkg:pypi/Werkzeug@2.2.3",
      "type": "library",
      "bom-ref": "pkg:pypi/Werkzeug@2.2.3"
    },
    {
      "name": "certifi",
      "version": "2022.12.7",
      "purl": "pkg:pypi/certifi@2022.12.7",
      "type": "library",
      "bom-ref": "pkg:pypi/certifi@2022.12.7"
    },
    {
      "name": "chardet",
      "version": "3.0.4",
      "purl": "pkg:pypi/chardet@3.0.4",
      "type": "library",
      "bom-ref": "pkg:pypi/chardet@3.0.4"
    },
    {
      "name": "click",
      "version": "8.1.3",
      "purl": "pkg:pypi/click@8.1.3",
      "type": "library",
      "bom-ref": "pkg:pypi/click@8.1.3"
    },
    {
      "name": "idna",
      "version": "2.6",
      "purl": "pkg:pypi/idna@2.6",
      "type": "library",
      "bom-ref": "pkg:pypi/idna@2.6"
    },
    {
      "name": "importlib-metadata",
      "version": "6.6.0",
      "purl": "pkg:pypi/importlib-metadata@6.6.0",
      "type": "library",
      "bom-ref": "pkg:pypi/importlib-metadata@6.6.0"
    },
    {
      "name": "inflection",
      "version": "0.5.1",
      "purl": "pkg:pypi/inflection@0.5.1",
      "type": "library",
      "bom-ref": "pkg:pypi/inflection@0.5.1"
    },
    {
      "name": "itsdangerous",
      "version": "2.1.2",
      "purl": "pkg:pypi/itsdangerous@2.1.2",
      "type": "library",
      "bom-ref": "pkg:pypi/itsdangerous@2.1.2"
    },
    {
      "name": "requests",
      "version": "2.18.4",
      "purl": "pkg:pypi/requests@2.18.4",
      "type": "library",
      "bom-ref": "pkg:pypi/requests@2.18.4"
    },
    {
      "name": "sh",
      "version": "1.14.2",
      "purl": "pkg:pypi/sh@1.14.2",
      "type": "library",
      "bom-ref": "pkg:pypi/sh@1.14.2"
    },
    {
      "name": "sys-toolkit",
      "version": "2.4.5",
      "purl": "pkg:pypi/sys-toolkit@2.4.5",
      "type": "library",
      "bom-ref": "pkg:pypi/sys-toolkit@2.4.5"
    },
    {
      "name": "urllib3",
      "version": "1.22",
      "purl": "pkg:pypi/urllib3@1.22",
      "type": "library",
      "bom-ref": "pkg:pypi/urllib3@1.22"
    },
    {
      "name": "zipp",
      "version": "3.15.0",
      "purl": "pkg:pypi/zipp@3.15.0",
      "type": "library",
      "bom-ref": "pkg:pypi/zipp@3.15.0"
    }
  ]
}
