{
  "bomFormat": "CycloneDX",
  "specVersion": "1.4",
  "serialNumber": "urn:uuid:e21102b8-66e7-498c-9ec1-39419b6a7051",
  "version": 1,
  "metadata": {
    "timestamp": "2023-03-18T19:34:15Z",
    "tools": [
      {
        "vendor": "GitLab",
        "name": "Gemnasium",
        "version": "3.13.0"
      }
    ],
    "authors": [
      {
        "name": "GitLab",
        "email": "support@gitlab.com"
      }
    ],
    "properties": [
      {
        "name": "gitlab:dependency_scanning:input_file",
        "value": "requirements.txt"
      },
      {
        "name": "gitlab:dependency_scanning:package_manager",
        "value": "pip"
      }
    ]
  },
  "components": [
    {
      "name": "Flask",
      "version": "0.12.2",
      "purl": "pkg:pypi/Flask@0.12.2",
      "type": "library",
      "bom-ref": "pkg:pypi/Flask@0.12.2"
    },
    {
      "name": "Jinja2",
      "version": "3.1.2",
      "purl": "pkg:pypi/Jinja2@3.1.2",
      "type": "library",
      "bom-ref": "pkg:pypi/Jinja2@3.1.2"
    },
    {
      "name": "MarkupSafe",
      "version": "2.1.2",
      "purl": "pkg:pypi/MarkupSafe@2.1.2",
      "type": "library",
      "bom-ref": "pkg:pypi/MarkupSafe@2.1.2"
    },
    {
      "name": "Werkzeug",
      "version": "0.15.1",
      "purl": "pkg:pypi/Werkzeug@0.15.1",
      "type": "library",
      "bom-ref": "pkg:pypi/Werkzeug@0.15.1"
    },
    {
      "name": "click",
      "version": "8.1.3",
      "purl": "pkg:pypi/click@8.1.3",
      "type": "library",
      "bom-ref": "pkg:pypi/click@8.1.3"
    },
    {
      "name": "itsdangerous",
      "version": "2.1.2",
      "purl": "pkg:pypi/itsdangerous@2.1.2",
      "type": "library",
      "bom-ref": "pkg:pypi/itsdangerous@2.1.2"
    }
  ]
}
