{
  "bomFormat": "CycloneDX",
  "specVersion": "1.4",
  "serialNumber": "urn:uuid:4a0a7855-75ce-409f-8b60-a57dd11d343b",
  "version": 1,
  "metadata": {
    "timestamp": "2023-06-14T06:04:22Z",
    "tools": [
      {
        "vendor": "GitLab",
        "name": "Gemnasium",
        "version": "4.0.3"
      }
    ],
    "authors": [
      {
        "name": "GitLab",
        "email": "support@gitlab.com"
      }
    ],
    "properties": [
      {
        "name": "gitlab:dependency_scanning:input_file",
        "value": "requirements.txt"
      },
      {
        "name": "gitlab:dependency_scanning:input_file:path",
        "value": "requirements.txt"
      },
      {
        "name": "gitlab:dependency_scanning:package_manager",
        "value": "pip"
      },
      {
        "name": "gitlab:dependency_scanning:package_manager:name",
        "value": "pip"
      },
      {
        "name": "gitlab:meta:schema_version",
        "value": "1"
      }
    ]
  },
  "components": [
    {
      "name": "Flask",
      "version": "0.12.2",
      "purl": "pkg:pypi/Flask@0.12.2",
      "type": "library",
      "bom-ref": "pkg:pypi/Flask@0.12.2"
    },
    {
      "name": "Jinja2",
      "version": "3.1.2",
      "purl": "pkg:pypi/Jinja2@3.1.2",
      "type": "library",
      "bom-ref": "pkg:pypi/Jinja2@3.1.2"
    },
    {
      "name": "MarkupSafe",
      "version": "2.1.3",
      "purl": "pkg:pypi/MarkupSafe@2.1.3",
      "type": "library",
      "bom-ref": "pkg:pypi/MarkupSafe@2.1.3"
    },
    {
      "name": "Werkzeug",
      "version": "0.15.1",
      "purl": "pkg:pypi/Werkzeug@0.15.1",
      "type": "library",
      "bom-ref": "pkg:pypi/Werkzeug@0.15.1"
    },
    {
      "name": "click",
      "version": "8.1.3",
      "purl": "pkg:pypi/click@8.1.3",
      "type": "library",
      "bom-ref": "pkg:pypi/click@8.1.3"
    },
    {
      "name": "itsdangerous",
      "version": "2.1.2",
      "purl": "pkg:pypi/itsdangerous@2.1.2",
      "type": "library",
      "bom-ref": "pkg:pypi/itsdangerous@2.1.2"
    },
    {
      "name": "sh",
      "version": "1.14.3",
      "purl": "pkg:pypi/sh@1.14.3",
      "type": "library",
      "bom-ref": "pkg:pypi/sh@1.14.3"
    }
  ]
}
