[api-updater (non-obsolete-error-filter)] 01/01/2021 13:08:27 : Starting C:/Program Files/Unity/Hub/Editor/2020.2.1f1/Editor/Data/Tools/ScriptUpdater/APIUpdater.NonObsoleteApiUpdaterDetector.exe
[api-updater (non-obsolete-error-filter)] 
----------------------------------
jit/startup time      : 409,7675ms
moved types parse time: 59ms
candidates parse time : 1ms
C# parse time         : 513ms
candidates check time : 43ms
console write time    : 2ms

[api-updater (non-obsolete-error-filter)] 01/01/2021 19:50:31 : Starting C:/Program Files/Unity/Hub/Editor/2020.2.1f1/Editor/Data/Tools/ScriptUpdater/APIUpdater.NonObsoleteApiUpdaterDetector.exe
[api-updater (non-obsolete-error-filter)] 
----------------------------------
jit/startup time      : 199,7975ms
moved types parse time: 48ms
candidates parse time : 1ms
C# parse time         : 251ms
candidates check time : 56ms
console write time    : 0ms

[api-updater (non-obsolete-error-filter)] 02/01/2021 23:31:01 : Starting C:/Program Files/Unity/Hub/Editor/2020.2.1f1/Editor/Data/Tools/ScriptUpdater/APIUpdater.NonObsoleteApiUpdaterDetector.exe
[api-updater (non-obsolete-error-filter)] 
----------------------------------
jit/startup time      : 631,1991ms
moved types parse time: 51ms
candidates parse time : 1ms
C# parse time         : 242ms
candidates check time : 50ms
console write time    : 0ms

[api-updater (non-obsolete-error-filter)] 03/01/2021 15:51:25 : Starting C:/Program Files/Unity/Hub/Editor/2020.2.1f1/Editor/Data/Tools/ScriptUpdater/APIUpdater.NonObsoleteApiUpdaterDetector.exe
[api-updater (non-obsolete-error-filter)] 
----------------------------------
jit/startup time      : 306,0228ms
moved types parse time: 55ms
candidates parse time : 1ms
C# parse time         : 276ms
candidates check time : 45ms
console write time    : 1ms

