\relax 
\providecommand\hyper@newdestlabel[2]{}
\catcode `:\active 
\catcode `;\active 
\catcode `!\active 
\catcode `?\active 
\providecommand\HyperFirstAtBeginDocument{\AtBeginDocument}
\HyperFirstAtBeginDocument{\ifx\hyper@anchor\@undefined
\global\let\oldcontentsline\contentsline
\gdef\contentsline#1#2#3#4{\oldcontentsline{#1}{#2}{#3}}
\global\let\oldnewlabel\newlabel
\gdef\newlabel#1#2{\newlabelxx{#1}#2}
\gdef\newlabelxx#1#2#3#4#5#6{\oldnewlabel{#1}{{#2}{#3}}}
\AtEndDocument{\ifx\hyper@anchor\@undefined
\let\contentsline\oldcontentsline
\let\newlabel\oldnewlabel
\fi}
\fi}
\global\let\hyper@last\relax 
\gdef\HyperFirstAtBeginDocument#1{#1}
\providecommand\HyField@AuxAddToFields[1]{}
\providecommand\HyField@AuxAddToCoFields[2]{}
\providecommand \oddpage@label [2]{}
\@writefile{toc}{\@ifundefined {etoctocstyle}{\let \etoc@startlocaltoc \@gobble \let \etoc@settocdepth \@gobble \let \etoc@depthtag \@gobble \let \etoc@setlocaltop \@gobble }{}}
\babel@aux{french}{}
\@writefile{toc}{\contentsline {chapter}{\numberline {1}Index des structures de donn\IeC {\'e}es}{1}{chapter.1}}
\@writefile{lof}{\addvspace {10\p@ }}
\@writefile{lot}{\addvspace {10\p@ }}
\@writefile{toc}{\contentsline {section}{\numberline {1.1}Structures de donn\IeC {\'e}es}{1}{section.1.1}}
\@writefile{toc}{\contentsline {chapter}{\numberline {2}Index des fichiers}{3}{chapter.2}}
\@writefile{lof}{\addvspace {10\p@ }}
\@writefile{lot}{\addvspace {10\p@ }}
\@writefile{toc}{\contentsline {section}{\numberline {2.1}Liste des fichiers}{3}{section.2.1}}
\gdef \LT@i {\LT@entry 
    {3}{37.31546pt}\LT@entry 
    {3}{208.24467pt}}
\@writefile{toc}{\contentsline {chapter}{\numberline {3}Documentation des structures de donn\IeC {\'e}es}{5}{chapter.3}}
\@writefile{lof}{\addvspace {10\p@ }}
\@writefile{lot}{\addvspace {10\p@ }}
\@writefile{toc}{\contentsline {section}{\numberline {3.1}R\IeC {\'e}f\IeC {\'e}rence de la structure automate\discretionary {\unhbox \voidb@x \hbox {\relax \fontsize  {7}{8}\selectfont  $\leftarrow \joinrel  \rhook $}}{}{}\_\discretionary {\unhbox \voidb@x \hbox {\relax \fontsize  {7}{8}\selectfont  $\leftarrow \joinrel  \rhook $}}{}{}cell}{5}{section.3.1}}
\newlabel{structautomate__cell}{{3.1}{5}{Référence de la structure automate\+\_\+cell}{section.3.1}{}}
\@writefile{toc}{\contentsline {subsection}{\numberline {3.1.1}Description d\IeC {\'e}taill\IeC {\'e}e}{5}{subsection.3.1.1}}
\@writefile{toc}{\contentsline {subsection}{\numberline {3.1.2}Documentation des champs}{5}{subsection.3.1.2}}
\newlabel{structautomate__cell_aae7e723d96c29e9bbfc2c8f95886e85a}{{3.1.2}{5}{Documentation des champs}{subsection.3.1.2}{}}
\gdef \LT@ii {\LT@entry 
    {3}{62.33499pt}\LT@entry 
    {3}{185.9703pt}}
\@writefile{toc}{\contentsline {subsubsection}{\numberline {3.1.2.1}f\_config}{6}{subsubsection.3.1.2.1}}
\newlabel{structautomate__cell_af27fecd3605ba100ac4c2a0b63aafab4}{{3.1.2.1}{6}{\texorpdfstring {f\_config}{f\_config}}{subsubsection.3.1.2.1}{}}
\@writefile{toc}{\contentsline {subsubsection}{\numberline {3.1.2.2}regle}{6}{subsubsection.3.1.2.2}}
\newlabel{structautomate__cell_ad49bf24c5f929d1ed8e22fee5935834b}{{3.1.2.2}{6}{\texorpdfstring {regle}{regle}}{subsubsection.3.1.2.2}{}}
\@writefile{toc}{\contentsline {subsubsection}{\numberline {3.1.2.3}tab}{6}{subsubsection.3.1.2.3}}
\@writefile{toc}{\contentsline {section}{\numberline {3.2}R\IeC {\'e}f\IeC {\'e}rence de la structure configuration}{6}{section.3.2}}
\newlabel{structconfiguration}{{3.2}{6}{Référence de la structure configuration}{section.3.2}{}}
\@writefile{toc}{\contentsline {subsection}{\numberline {3.2.1}Description d\IeC {\'e}taill\IeC {\'e}e}{6}{subsection.3.2.1}}
\@writefile{toc}{\contentsline {subsection}{\numberline {3.2.2}Documentation des champs}{7}{subsection.3.2.2}}
\newlabel{structconfiguration_ab87fd09c380492db266c031c063e903e}{{3.2.2}{7}{Documentation des champs}{subsection.3.2.2}{}}
\@writefile{toc}{\contentsline {subsubsection}{\numberline {3.2.2.1}etat\_centre}{7}{subsubsection.3.2.2.1}}
\newlabel{structconfiguration_af4a4f6949170c15a38caed135c60f02a}{{3.2.2.1}{7}{\texorpdfstring {etat\_centre}{etat\_centre}}{subsubsection.3.2.2.1}{}}
\@writefile{toc}{\contentsline {subsubsection}{\numberline {3.2.2.2}etat\_droite}{7}{subsubsection.3.2.2.2}}
\newlabel{structconfiguration_a4c2a28574421b356a94b2986af8cbd1f}{{3.2.2.2}{7}{\texorpdfstring {etat\_droite}{etat\_droite}}{subsubsection.3.2.2.2}{}}
\@writefile{toc}{\contentsline {subsubsection}{\numberline {3.2.2.3}etat\_gauche}{7}{subsubsection.3.2.2.3}}
\newlabel{structconfiguration_abf5d66a5150f63e202481a01797671f1}{{3.2.2.3}{7}{\texorpdfstring {etat\_gauche}{etat\_gauche}}{subsubsection.3.2.2.3}{}}
\@writefile{toc}{\contentsline {subsubsection}{\numberline {3.2.2.4}etat\_sortie}{7}{subsubsection.3.2.2.4}}
\@writefile{toc}{\contentsline {section}{\numberline {3.3}R\IeC {\'e}f\IeC {\'e}rence de la structure fichier\discretionary {\unhbox \voidb@x \hbox {\relax \fontsize  {7}{8}\selectfont  $\leftarrow \joinrel  \rhook $}}{}{}\_\discretionary {\unhbox \voidb@x \hbox {\relax \fontsize  {7}{8}\selectfont  $\leftarrow \joinrel  \rhook $}}{}{}configuration}{7}{section.3.3}}
\newlabel{structfichier__configuration}{{3.3}{7}{Référence de la structure fichier\+\_\+configuration}{section.3.3}{}}
\@writefile{toc}{\contentsline {subsection}{\numberline {3.3.1}Description d\IeC {\'e}taill\IeC {\'e}e}{7}{subsection.3.3.1}}
\gdef \LT@iii {\LT@entry 
    {3}{92.32248pt}\LT@entry 
    {3}{363.96883pt}}
\@writefile{toc}{\contentsline {subsection}{\numberline {3.3.2}Documentation des champs}{8}{subsection.3.3.2}}
\newlabel{structfichier__configuration_adad9a37061420fd84387f25b6a83b609}{{3.3.2}{8}{Documentation des champs}{subsection.3.3.2}{}}
\@writefile{toc}{\contentsline {subsubsection}{\numberline {3.3.2.1}cellule\_symbole}{8}{subsubsection.3.3.2.1}}
\newlabel{structfichier__configuration_a77928a6819cdd77313e2b62249512fbf}{{3.3.2.1}{8}{\texorpdfstring {cellule\_symbole}{cellule\_symbole}}{subsubsection.3.3.2.1}{}}
\@writefile{toc}{\contentsline {subsubsection}{\numberline {3.3.2.2}emplacement\_initial}{8}{subsubsection.3.3.2.2}}
\newlabel{structfichier__configuration_ab267b680af93f62025924c996a89fd00}{{3.3.2.2}{8}{\texorpdfstring {emplacement\_initial}{emplacement\_initial}}{subsubsection.3.3.2.2}{}}
\@writefile{toc}{\contentsline {subsubsection}{\numberline {3.3.2.3}enregistrer\_image}{8}{subsubsection.3.3.2.3}}
\newlabel{structfichier__configuration_ac3fc21fbeb899cb37ea7857bd2f5771b}{{3.3.2.3}{8}{\texorpdfstring {enregistrer\_image}{enregistrer\_image}}{subsubsection.3.3.2.3}{}}
\@writefile{toc}{\contentsline {subsubsection}{\numberline {3.3.2.4}hauteur}{8}{subsubsection.3.3.2.4}}
\newlabel{structfichier__configuration_a57e9bc2e6956d6fbbb7c6045ecbeac32}{{3.3.2.4}{8}{\texorpdfstring {hauteur}{hauteur}}{subsubsection.3.3.2.4}{}}
\@writefile{toc}{\contentsline {subsubsection}{\numberline {3.3.2.5}largeur}{9}{subsubsection.3.3.2.5}}
\newlabel{structfichier__configuration_aa14cbe479b974778f69205c5f573f0aa}{{3.3.2.5}{9}{\texorpdfstring {largeur}{largeur}}{subsubsection.3.3.2.5}{}}
\@writefile{toc}{\contentsline {subsubsection}{\numberline {3.3.2.6}nb\_etat}{9}{subsubsection.3.3.2.6}}
\newlabel{structfichier__configuration_a9512fa1069b7922c64de2f769d89a81b}{{3.3.2.6}{9}{\texorpdfstring {nb\_etat}{nb\_etat}}{subsubsection.3.3.2.6}{}}
\@writefile{toc}{\contentsline {subsubsection}{\numberline {3.3.2.7}nb\_magique}{9}{subsubsection.3.3.2.7}}
\newlabel{structfichier__configuration_a441b3f030abb5b30543968f9f1a5be0d}{{3.3.2.7}{9}{\texorpdfstring {nb\_magique}{nb\_magique}}{subsubsection.3.3.2.7}{}}
\@writefile{toc}{\contentsline {subsubsection}{\numberline {3.3.2.8}regle}{9}{subsubsection.3.3.2.8}}
\@writefile{toc}{\contentsline {section}{\numberline {3.4}R\IeC {\'e}f\IeC {\'e}rence de la structure regle}{9}{section.3.4}}
\newlabel{structregle}{{3.4}{9}{Référence de la structure regle}{section.3.4}{}}
\@writefile{toc}{\contentsline {subsection}{\numberline {3.4.1}Description d\IeC {\'e}taill\IeC {\'e}e}{9}{subsection.3.4.1}}
\gdef \LT@iv {\LT@entry 
    {3}{84.23177pt}\LT@entry 
    {3}{196.42845pt}}
\@writefile{toc}{\contentsline {subsection}{\numberline {3.4.2}Documentation des champs}{10}{subsection.3.4.2}}
\newlabel{structregle_a8c35c594e654c2a92873f1514e46cf28}{{3.4.2}{10}{Documentation des champs}{subsection.3.4.2}{}}
\@writefile{toc}{\contentsline {subsubsection}{\numberline {3.4.2.1}nombre\_etat}{10}{subsubsection.3.4.2.1}}
\newlabel{structregle_a821262df99649ddc1d41aede824b65dc}{{3.4.2.1}{10}{\texorpdfstring {nombre\_etat}{nombre\_etat}}{subsubsection.3.4.2.1}{}}
\@writefile{toc}{\contentsline {subsubsection}{\numberline {3.4.2.2}numero\_binaire}{10}{subsubsection.3.4.2.2}}
\newlabel{structregle_a2260faec26c7e458eac1791a03db49c9}{{3.4.2.2}{10}{\texorpdfstring {numero\_binaire}{numero\_binaire}}{subsubsection.3.4.2.2}{}}
\@writefile{toc}{\contentsline {subsubsection}{\numberline {3.4.2.3}numero\_decimale}{10}{subsubsection.3.4.2.3}}
\newlabel{structregle_aaee555382d08e4f817d968c8e25e74ad}{{3.4.2.3}{10}{\texorpdfstring {numero\_decimale}{numero\_decimale}}{subsubsection.3.4.2.3}{}}
\@writefile{toc}{\contentsline {subsubsection}{\numberline {3.4.2.4}tab\_configuration}{10}{subsubsection.3.4.2.4}}
\@writefile{toc}{\contentsline {chapter}{\numberline {4}Documentation des fichiers}{11}{chapter.4}}
\@writefile{lof}{\addvspace {10\p@ }}
\@writefile{lot}{\addvspace {10\p@ }}
\@writefile{toc}{\contentsline {section}{\numberline {4.1}R\IeC {\'e}f\IeC {\'e}rence du fichier src/automate.c}{11}{section.4.1}}
\newlabel{automate_8c}{{4.1}{11}{Référence du fichier src/automate.c}{section.4.1}{}}
\gdef \LT@v {\LT@entry 
    {3}{50.3202pt}\LT@entry 
    {3}{215.12955pt}}
\@writefile{toc}{\contentsline {subsection}{\numberline {4.1.1}Description d\IeC {\'e}taill\IeC {\'e}e}{12}{subsection.4.1.1}}
\@writefile{toc}{\contentsline {subsection}{\numberline {4.1.2}Documentation des fonctions}{12}{subsection.4.1.2}}
\newlabel{automate_8c_a320cea72ddfeeb38cef103fff39e31b4}{{4.1.2}{12}{Documentation des fonctions}{subsection.4.1.2}{}}
\@writefile{toc}{\contentsline {subsubsection}{\numberline {4.1.2.1}\_affiche\_automate\_image()}{12}{subsubsection.4.1.2.1}}
\gdef \LT@vi {\LT@entry 
    {3}{50.3202pt}\LT@entry 
    {3}{215.12955pt}}
\newlabel{automate_8c_ab13ad43eea87c41a9a080239a0887a7f}{{4.1.2.1}{13}{\texorpdfstring {\_affiche\_automate\_image()}{\_affiche\_automate\_image()}}{figure.caption.9}{}}
\@writefile{toc}{\contentsline {subsubsection}{\numberline {4.1.2.2}\_affiche\_automate\_terminal\_binaire()}{13}{subsubsection.4.1.2.2}}
\gdef \LT@vii {\LT@entry 
    {3}{50.3202pt}\LT@entry 
    {3}{215.12955pt}}
\newlabel{automate_8c_a9fdbceb307999d064bf86f99d3598539}{{4.1.2.2}{14}{\texorpdfstring {\_affiche\_automate\_terminal\_binaire()}{\_affiche\_automate\_terminal\_binaire()}}{figure.caption.11}{}}
\@writefile{toc}{\contentsline {subsubsection}{\numberline {4.1.2.3}\_affiche\_automate\_terminal\_somme()}{14}{subsubsection.4.1.2.3}}
\gdef \LT@viii {\LT@entry 
    {3}{50.3202pt}\LT@entry 
    {3}{236.97218pt}}
\newlabel{automate_8c_a5739d8a1c873eea2c0a1099cc20ea7ef}{{4.1.2.3}{15}{\texorpdfstring {\_affiche\_automate\_terminal\_somme()}{\_affiche\_automate\_terminal\_somme()}}{figure.caption.13}{}}
\@writefile{toc}{\contentsline {subsubsection}{\numberline {4.1.2.4}affiche\_automate()}{15}{subsubsection.4.1.2.4}}
\gdef \LT@ix {\LT@entry 
    {3}{44.31744pt}\LT@entry 
    {3}{242.03925pt}}
\newlabel{automate_8c_a117ebb3a717f9bbd035e7b295dcf26cb}{{4.1.2.4}{16}{\texorpdfstring {affiche\_automate()}{affiche\_automate()}}{figure.caption.14}{}}
\@writefile{toc}{\contentsline {subsubsection}{\numberline {4.1.2.5}creer\_automate()}{16}{subsubsection.4.1.2.5}}
\gdef \LT@x {\LT@entry 
    {3}{23.30272pt}\LT@entry 
    {3}{215.12955pt}}
\newlabel{automate_8c_aa3ba78ebbf6cec54e6e4e0fa0fced8ee}{{4.1.2.5}{17}{\texorpdfstring {creer\_automate()}{creer\_automate()}}{figure.caption.16}{}}
\@writefile{toc}{\contentsline {subsubsection}{\numberline {4.1.2.6}delete\_automate()}{17}{subsubsection.4.1.2.6}}
\gdef \LT@xi {\LT@entry 
    {3}{50.3202pt}\LT@entry 
    {3}{230.13225pt}}
\newlabel{automate_8c_aa3e1c93736b3bc4efedcb6a9846b1889}{{4.1.2.6}{18}{\texorpdfstring {delete\_automate()}{delete\_automate()}}{figure.caption.18}{}}
\@writefile{toc}{\contentsline {subsubsection}{\numberline {4.1.2.7}evoluer()}{18}{subsubsection.4.1.2.7}}
\@writefile{toc}{\contentsline {section}{\numberline {4.2}R\IeC {\'e}f\IeC {\'e}rence du fichier src/configuration.c}{19}{section.4.2}}
\newlabel{configuration_8c}{{4.2}{19}{Référence du fichier src/configuration.c}{section.4.2}{}}
\@writefile{toc}{\contentsline {subsection}{\numberline {4.2.1}Description d\IeC {\'e}taill\IeC {\'e}e}{19}{subsection.4.2.1}}
\gdef \LT@xii {\LT@entry 
    {3}{23.30272pt}\LT@entry 
    {3}{225.5424pt}}
\@writefile{toc}{\contentsline {subsection}{\numberline {4.2.2}Documentation des fonctions}{20}{subsection.4.2.2}}
\newlabel{configuration_8c_ad6bae512bff79422335f1132a8ac5695}{{4.2.2}{20}{Documentation des fonctions}{subsection.4.2.2}{}}
\@writefile{toc}{\contentsline {subsubsection}{\numberline {4.2.2.1}afficher\_configuration\_elementaire()}{20}{subsubsection.4.2.2.1}}
\newlabel{configuration_8c_a0142d10519eacf9f6489fc21cdcaa759}{{4.2.2.1}{20}{\texorpdfstring {afficher\_configuration\_elementaire()}{afficher\_configuration\_elementaire()}}{figure.caption.24}{}}
\gdef \LT@xiii {\LT@entry 
    {3}{36.30759pt}\LT@entry 
    {3}{185.5203pt}}
\gdef \LT@xiv {\LT@entry 
    {3}{34.81357pt}\LT@entry 
    {3}{225.5424pt}}
\@writefile{toc}{\contentsline {subsubsection}{\numberline {4.2.2.2}afficher\_configuration\_multiple()}{21}{subsubsection.4.2.2.2}}
\newlabel{configuration_8c_ab64d6ac48d2c2034a1f505bc2d174154}{{4.2.2.2}{21}{\texorpdfstring {afficher\_configuration\_multiple()}{afficher\_configuration\_multiple()}}{figure.caption.25}{}}
\@writefile{toc}{\contentsline {subsubsection}{\numberline {4.2.2.3}cmp\_conf()}{21}{subsubsection.4.2.2.3}}
\gdef \LT@xv {\LT@entry 
    {3}{23.30272pt}\LT@entry 
    {3}{171.60645pt}}
\newlabel{configuration_8c_a2da1ecaa0c8bee5b0de11c7a0cf25376}{{4.2.2.3}{22}{\texorpdfstring {cmp\_conf()}{cmp\_conf()}}{figure.caption.26}{}}
\@writefile{toc}{\contentsline {subsubsection}{\numberline {4.2.2.4}creer\_configuration()}{22}{subsubsection.4.2.2.4}}
\newlabel{configuration_8c_a186fea29942ab35b744e99b54d731d23}{{4.2.2.4}{22}{\texorpdfstring {creer\_configuration()}{creer\_configuration()}}{figure.caption.27}{}}
\@writefile{toc}{\contentsline {subsubsection}{\numberline {4.2.2.5}get\_etat\_centre()}{22}{subsubsection.4.2.2.5}}
\gdef \LT@xvi {\LT@entry 
    {3}{23.30272pt}\LT@entry 
    {3}{171.60645pt}}
\gdef \LT@xvii {\LT@entry 
    {3}{23.30272pt}\LT@entry 
    {3}{171.60645pt}}
\newlabel{configuration_8c_a864b89b01c028493f6b7c31523277806}{{4.2.2.5}{23}{\texorpdfstring {get\_etat\_centre()}{get\_etat\_centre()}}{table.4.11}{}}
\@writefile{toc}{\contentsline {subsubsection}{\numberline {4.2.2.6}get\_etat\_droite()}{23}{subsubsection.4.2.2.6}}
\newlabel{configuration_8c_aa857710a78f4427585c4014ea25ad263}{{4.2.2.6}{23}{\texorpdfstring {get\_etat\_droite()}{get\_etat\_droite()}}{table.4.12}{}}
\@writefile{toc}{\contentsline {subsubsection}{\numberline {4.2.2.7}get\_etat\_gauche()}{23}{subsubsection.4.2.2.7}}
\newlabel{configuration_8c_a9555a26a5ba14b904e676207072cc5af}{{4.2.2.7}{23}{\texorpdfstring {get\_etat\_gauche()}{get\_etat\_gauche()}}{table.4.13}{}}
\@writefile{toc}{\contentsline {subsubsection}{\numberline {4.2.2.8}get\_etat\_sortie()}{23}{subsubsection.4.2.2.8}}
\gdef \LT@xviii {\LT@entry 
    {3}{23.30272pt}\LT@entry 
    {3}{171.60645pt}}
\gdef \LT@xix {\LT@entry 
    {3}{42.31949pt}\LT@entry 
    {3}{186.96904pt}}
\newlabel{configuration_8c_a8683ab4db526e75f84e627323f8a4b01}{{4.2.2.8}{24}{\texorpdfstring {get\_etat\_sortie()}{get\_etat\_sortie()}}{figure.caption.28}{}}
\@writefile{toc}{\contentsline {subsubsection}{\numberline {4.2.2.9}init\_configuration\_entree()}{24}{subsubsection.4.2.2.9}}
\gdef \LT@xx {\LT@entry 
    {3}{35.16446pt}\LT@entry 
    {3}{171.60645pt}}
\newlabel{configuration_8c_ab6f7671e46ec27554e8ab5da3a87e71d}{{4.2.2.9}{25}{\texorpdfstring {init\_configuration\_entree()}{init\_configuration\_entree()}}{figure.caption.29}{}}
\@writefile{toc}{\contentsline {subsubsection}{\numberline {4.2.2.10}init\_configuration\_sortie()}{25}{subsubsection.4.2.2.10}}
\@writefile{toc}{\contentsline {section}{\numberline {4.3}R\IeC {\'e}f\IeC {\'e}rence du fichier src/fichier\discretionary {\unhbox \voidb@x \hbox {\relax \fontsize  {7}{8}\selectfont  $\leftarrow \joinrel  \rhook $}}{}{}\_\discretionary {\unhbox \voidb@x \hbox {\relax \fontsize  {7}{8}\selectfont  $\leftarrow \joinrel  \rhook $}}{}{}configuration.c}{25}{section.4.3}}
\newlabel{fichier__configuration_8c}{{4.3}{25}{Référence du fichier src/fichier\+\_\+configuration.c}{section.4.3}{}}
\@writefile{toc}{\contentsline {subsection}{\numberline {4.3.1}Description d\IeC {\'e}taill\IeC {\'e}e}{26}{subsection.4.3.1}}
\@writefile{toc}{\contentsline {subsection}{\numberline {4.3.2}Documentation des fonctions}{26}{subsection.4.3.2}}
\newlabel{fichier__configuration_8c_a47a2d2c118d7e2b8ae5e68f3344808e6}{{4.3.2}{26}{Documentation des fonctions}{subsection.4.3.2}{}}
\@writefile{toc}{\contentsline {subsubsection}{\numberline {4.3.2.1}afficher\_fichier\_configuration()}{26}{subsubsection.4.3.2.1}}
\gdef \LT@xxi {\LT@entry 
    {3}{44.31744pt}\LT@entry 
    {3}{240.55412pt}}
\gdef \LT@xxii {\LT@entry 
    {3}{59.31125pt}\LT@entry 
    {3}{303.70569pt}}
\newlabel{fichier__configuration_8c_ad80bfd5b28d3fc81e66d83fa23690e88}{{4.3.2.1}{27}{\texorpdfstring {afficher\_fichier\_configuration()}{afficher\_fichier\_configuration()}}{table.4.17}{}}
\@writefile{toc}{\contentsline {subsubsection}{\numberline {4.3.2.2}creer\_fichier\_configuration()}{27}{subsubsection.4.3.2.2}}
\newlabel{fichier__configuration_8c_a8e23c05945f10746ec4182b61123af00}{{4.3.2.2}{27}{\texorpdfstring {creer\_fichier\_configuration()}{creer\_fichier\_configuration()}}{figure.caption.35}{}}
\gdef \LT@xxiii {\LT@entry 
    {3}{44.31744pt}\LT@entry 
    {3}{242.04814pt}}
\gdef \LT@xxiv {\LT@entry 
    {3}{44.31744pt}\LT@entry 
    {3}{242.04814pt}}
\@writefile{toc}{\contentsline {subsubsection}{\numberline {4.3.2.3}delete\_fichier\_configuration()}{28}{subsubsection.4.3.2.3}}
\newlabel{fichier__configuration_8c_a50675bf48ff97d3282760437d7e9c69e}{{4.3.2.3}{28}{\texorpdfstring {delete\_fichier\_configuration()}{delete\_fichier\_configuration()}}{figure.caption.36}{}}
\@writefile{toc}{\contentsline {subsubsection}{\numberline {4.3.2.4}get\_cellule\_symbole()}{28}{subsubsection.4.3.2.4}}
\gdef \LT@xxv {\LT@entry 
    {3}{44.31744pt}\LT@entry 
    {3}{242.04814pt}}
\newlabel{fichier__configuration_8c_a21bb44a3b30408468720e6eb6eaa60ac}{{4.3.2.4}{29}{\texorpdfstring {get\_cellule\_symbole()}{get\_cellule\_symbole()}}{figure.caption.37}{}}
\@writefile{toc}{\contentsline {subsubsection}{\numberline {4.3.2.5}get\_emplacement\_initial()}{29}{subsubsection.4.3.2.5}}
\newlabel{fichier__configuration_8c_a0747aaffe60671eda2ba956722a8c191}{{4.3.2.5}{29}{\texorpdfstring {get\_emplacement\_initial()}{get\_emplacement\_initial()}}{figure.caption.38}{}}
\@writefile{toc}{\contentsline {subsubsection}{\numberline {4.3.2.6}get\_enregistrer\_image()}{29}{subsubsection.4.3.2.6}}
\gdef \LT@xxvi {\LT@entry 
    {3}{44.31744pt}\LT@entry 
    {3}{242.04814pt}}
\gdef \LT@xxvii {\LT@entry 
    {3}{44.31744pt}\LT@entry 
    {3}{242.04814pt}}
\newlabel{fichier__configuration_8c_afc113bc5216673e023757de45be2e009}{{4.3.2.6}{30}{\texorpdfstring {get\_enregistrer\_image()}{get\_enregistrer\_image()}}{figure.caption.39}{}}
\@writefile{toc}{\contentsline {subsubsection}{\numberline {4.3.2.7}get\_hauteur()}{30}{subsubsection.4.3.2.7}}
\gdef \LT@xxviii {\LT@entry 
    {3}{44.31744pt}\LT@entry 
    {3}{242.04814pt}}
\newlabel{fichier__configuration_8c_a1b660f6a0cca911778798dfe26976cdd}{{4.3.2.7}{31}{\texorpdfstring {get\_hauteur()}{get\_hauteur()}}{figure.caption.40}{}}
\@writefile{toc}{\contentsline {subsubsection}{\numberline {4.3.2.8}get\_largeur()}{31}{subsubsection.4.3.2.8}}
\gdef \LT@xxix {\LT@entry 
    {3}{44.31744pt}\LT@entry 
    {3}{242.04814pt}}
\newlabel{fichier__configuration_8c_afef69ee54144409041ea66d6e1185312}{{4.3.2.8}{32}{\texorpdfstring {get\_largeur()}{get\_largeur()}}{figure.caption.41}{}}
\@writefile{toc}{\contentsline {subsubsection}{\numberline {4.3.2.9}get\_nb\_etat()}{32}{subsubsection.4.3.2.9}}
\gdef \LT@xxx {\LT@entry 
    {3}{44.31744pt}\LT@entry 
    {3}{242.04814pt}}
\newlabel{fichier__configuration_8c_af66f6107d4b7f6e4de23bd6f697ccaf8}{{4.3.2.9}{33}{\texorpdfstring {get\_nb\_etat()}{get\_nb\_etat()}}{figure.caption.42}{}}
\@writefile{toc}{\contentsline {subsubsection}{\numberline {4.3.2.10}get\_nb\_magique()}{33}{subsubsection.4.3.2.10}}
\newlabel{fichier__configuration_8c_ae0ce5e18cc06c038b2ae5ab594e5e9e7}{{4.3.2.10}{33}{\texorpdfstring {get\_nb\_magique()}{get\_nb\_magique()}}{figure.caption.43}{}}
\gdef \LT@xxxi {\LT@entry 
    {3}{44.31744pt}\LT@entry 
    {3}{242.04814pt}}
\gdef \LT@xxxii {\LT@entry 
    {3}{44.31744pt}\LT@entry 
    {3}{240.55412pt}}
\@writefile{toc}{\contentsline {subsubsection}{\numberline {4.3.2.11}get\_regle()}{34}{subsubsection.4.3.2.11}}
\newlabel{fichier__configuration_8c_aaa4841f314f9c7b1eb6130886505c149}{{4.3.2.11}{34}{\texorpdfstring {get\_regle()}{get\_regle()}}{figure.caption.44}{}}
\@writefile{toc}{\contentsline {subsubsection}{\numberline {4.3.2.12}lecture\_fichier\_configuration()}{34}{subsubsection.4.3.2.12}}
\@writefile{toc}{\contentsline {section}{\numberline {4.4}R\IeC {\'e}f\IeC {\'e}rence du fichier src/image.c}{35}{section.4.4}}
\newlabel{image_8c}{{4.4}{35}{Référence du fichier src/image.c}{section.4.4}{}}
\@writefile{toc}{\contentsline {subsection}{\numberline {4.4.1}Description d\IeC {\'e}taill\IeC {\'e}e}{35}{subsection.4.4.1}}
\gdef \LT@xxxiii {\LT@entry 
    {3}{44.31744pt}\LT@entry 
    {3}{257.05084pt}}
\@writefile{toc}{\contentsline {subsection}{\numberline {4.4.2}Documentation des fonctions}{36}{subsection.4.4.2}}
\newlabel{image_8c_af3ac482597fe1d1d8fdad40e3119b896}{{4.4.2}{36}{Documentation des fonctions}{subsection.4.4.2}{}}
\@writefile{toc}{\contentsline {subsubsection}{\numberline {4.4.2.1}creer\_image()}{36}{subsubsection.4.4.2.1}}
\gdef \LT@xxxiv {\LT@entry 
    {3}{44.31744pt}\LT@entry 
    {3}{257.05084pt}}
\newlabel{image_8c_a9aac53703bab191011d8c1b8ec52b630}{{4.4.2.1}{37}{\texorpdfstring {creer\_image()}{creer\_image()}}{figure.caption.49}{}}
\@writefile{toc}{\contentsline {subsubsection}{\numberline {4.4.2.2}ecrire\_donnees\_image\_ascii()}{37}{subsubsection.4.4.2.2}}
\gdef \LT@xxxv {\LT@entry 
    {3}{44.31744pt}\LT@entry 
    {3}{257.05084pt}}
\newlabel{image_8c_a15ea0f80adae8f83b853c427a2254ae8}{{4.4.2.2}{38}{\texorpdfstring {ecrire\_donnees\_image\_ascii()}{ecrire\_donnees\_image\_ascii()}}{figure.caption.51}{}}
\@writefile{toc}{\contentsline {subsubsection}{\numberline {4.4.2.3}ecrire\_donnees\_image\_binaire()}{38}{subsubsection.4.4.2.3}}
\gdef \LT@xxxvi {\LT@entry 
    {3}{44.31744pt}\LT@entry 
    {3}{257.05084pt}}
\newlabel{image_8c_a1251ec097153c17cdf6ef77b20e7eceb}{{4.4.2.3}{39}{\texorpdfstring {ecrire\_donnees\_image\_binaire()}{ecrire\_donnees\_image\_binaire()}}{figure.caption.53}{}}
\@writefile{toc}{\contentsline {subsubsection}{\numberline {4.4.2.4}ecrire\_entete\_image()}{39}{subsubsection.4.4.2.4}}
\@writefile{toc}{\contentsline {section}{\numberline {4.5}R\IeC {\'e}f\IeC {\'e}rence du fichier src/main.c}{40}{section.4.5}}
\newlabel{main_8c}{{4.5}{40}{Référence du fichier src/main.c}{section.4.5}{}}
\@writefile{toc}{\contentsline {subsection}{\numberline {4.5.1}Description d\IeC {\'e}taill\IeC {\'e}e}{40}{subsection.4.5.1}}
\gdef \LT@xxxvii {\LT@entry 
    {3}{30.3047pt}\LT@entry 
    {3}{272.63869pt}}
\@writefile{toc}{\contentsline {subsection}{\numberline {4.5.2}Documentation des fonctions}{41}{subsection.4.5.2}}
\newlabel{main_8c_abf9e6b7e6f15df4b525a2e7705ba3089}{{4.5.2}{41}{Documentation des fonctions}{subsection.4.5.2}{}}
\@writefile{toc}{\contentsline {subsubsection}{\numberline {4.5.2.1}main()}{41}{subsubsection.4.5.2.1}}
\@writefile{toc}{\contentsline {section}{\numberline {4.6}R\IeC {\'e}f\IeC {\'e}rence du fichier src/regle.c}{41}{section.4.6}}
\newlabel{regle_8c}{{4.6}{41}{Référence du fichier src/regle.c}{section.4.6}{}}
\@writefile{toc}{\contentsline {subsection}{\numberline {4.6.1}Description d\IeC {\'e}taill\IeC {\'e}e}{42}{subsection.4.6.1}}
\gdef \LT@xxxviii {\LT@entry 
    {3}{75.23183pt}\LT@entry 
    {3}{292.34808pt}}
\@writefile{toc}{\contentsline {subsection}{\numberline {4.6.2}Documentation des fonctions}{43}{subsection.4.6.2}}
\newlabel{regle_8c_a251bd1b86ce38f9b98b2bd4ec42432da}{{4.6.2}{43}{Documentation des fonctions}{subsection.4.6.2}{}}
\@writefile{toc}{\contentsline {subsubsection}{\numberline {4.6.2.1}\_config\_binaire()}{43}{subsubsection.4.6.2.1}}
\gdef \LT@xxxix {\LT@entry 
    {3}{75.23183pt}\LT@entry 
    {3}{292.34808pt}}
\newlabel{regle_8c_ac7b95dee8a7e84ea3037cb05a7c963f5}{{4.6.2.1}{44}{\texorpdfstring {\_config\_binaire()}{\_config\_binaire()}}{figure.caption.63}{}}
\@writefile{toc}{\contentsline {subsubsection}{\numberline {4.6.2.2}\_config\_somme()}{44}{subsubsection.4.6.2.2}}
\gdef \LT@xl {\LT@entry 
    {3}{23.30272pt}\LT@entry 
    {3}{194.11494pt}}
\newlabel{regle_8c_a3f644974675b843554ffe9330ef4846b}{{4.6.2.2}{45}{\texorpdfstring {\_config\_somme()}{\_config\_somme()}}{figure.caption.65}{}}
\@writefile{toc}{\contentsline {subsubsection}{\numberline {4.6.2.3}afficher\_regle()}{45}{subsubsection.4.6.2.3}}
\gdef \LT@xli {\LT@entry 
    {3}{63.32495pt}\LT@entry 
    {3}{190.94704pt}}
\newlabel{regle_8c_a66825a41280d604f6cd3c8b5f373a7ee}{{4.6.2.3}{46}{\texorpdfstring {afficher\_regle()}{afficher\_regle()}}{figure.caption.66}{}}
\@writefile{toc}{\contentsline {subsubsection}{\numberline {4.6.2.4}creer\_regle()}{46}{subsubsection.4.6.2.4}}
\gdef \LT@xlii {\LT@entry 
    {3}{75.23183pt}\LT@entry 
    {3}{292.34808pt}}
\newlabel{regle_8c_a012109f6ea56e4d9315d79f8a8f3f8e0}{{4.6.2.4}{47}{\texorpdfstring {creer\_regle()}{creer\_regle()}}{figure.caption.68}{}}
\@writefile{toc}{\contentsline {subsubsection}{\numberline {4.6.2.5}creer\_tableau\_configuration()}{47}{subsubsection.4.6.2.5}}
\gdef \LT@xliii {\LT@entry 
    {3}{23.30272pt}\LT@entry 
    {3}{194.11494pt}}
\gdef \LT@xliv {\LT@entry 
    {3}{23.30272pt}\LT@entry 
    {3}{194.11494pt}}
\newlabel{regle_8c_a12710fa473da40d460ea41037c23ade9}{{4.6.2.5}{48}{\texorpdfstring {creer\_tableau\_configuration()}{creer\_tableau\_configuration()}}{figure.caption.69}{}}
\@writefile{toc}{\contentsline {subsubsection}{\numberline {4.6.2.6}delete\_regle()}{48}{subsubsection.4.6.2.6}}
\newlabel{regle_8c_a46e5c74eda89fcaf925f91806d5bf86c}{{4.6.2.6}{48}{\texorpdfstring {delete\_regle()}{delete\_regle()}}{figure.caption.70}{}}
\@writefile{toc}{\contentsline {subsubsection}{\numberline {4.6.2.7}get\_nombre\_etat()}{48}{subsubsection.4.6.2.7}}
\gdef \LT@xlv {\LT@entry 
    {3}{23.30272pt}\LT@entry 
    {3}{194.11494pt}}
\newlabel{regle_8c_ab5f4f5a6960efe9d383d86c67c4f7190}{{4.6.2.7}{49}{\texorpdfstring {get\_nombre\_etat()}{get\_nombre\_etat()}}{figure.caption.71}{}}
\@writefile{toc}{\contentsline {subsubsection}{\numberline {4.6.2.8}get\_numero\_binaire()}{49}{subsubsection.4.6.2.8}}
\newlabel{regle_8c_abb64bb8f15528e167294857d015a193a}{{4.6.2.8}{49}{\texorpdfstring {get\_numero\_binaire()}{get\_numero\_binaire()}}{figure.caption.72}{}}
\gdef \LT@xlvi {\LT@entry 
    {3}{23.30272pt}\LT@entry 
    {3}{194.11494pt}}
\gdef \LT@xlvii {\LT@entry 
    {3}{23.30272pt}\LT@entry 
    {3}{194.11494pt}}
\@writefile{toc}{\contentsline {subsubsection}{\numberline {4.6.2.9}get\_numero\_decimale()}{50}{subsubsection.4.6.2.9}}
\newlabel{regle_8c_ac7ca766573256b9fdbf502eed89d98e9}{{4.6.2.9}{50}{\texorpdfstring {get\_numero\_decimale()}{get\_numero\_decimale()}}{figure.caption.73}{}}
\@writefile{toc}{\contentsline {subsubsection}{\numberline {4.6.2.10}get\_tab\_configuration()}{50}{subsubsection.4.6.2.10}}
\newlabel{regle_8c_a73aeb391bdf6be3f730c3d725360257a}{{4.6.2.10}{50}{\texorpdfstring {get\_tab\_configuration()}{get\_tab\_configuration()}}{table.4.43}{}}
\gdef \LT@xlviii {\LT@entry 
    {3}{32.8066pt}\LT@entry 
    {3}{225.5424pt}}
\@writefile{toc}{\contentsline {subsubsection}{\numberline {4.6.2.11}recherche\_configuration()}{51}{subsubsection.4.6.2.11}}
\newlabel{regle_8c_ad852e50dfdd6aa3660731b37de177d2c}{{4.6.2.11}{51}{\texorpdfstring {recherche\_configuration()}{recherche\_configuration()}}{figure.caption.75}{}}
\@writefile{toc}{\contentsline {subsubsection}{\numberline {4.6.2.12}recherche\_indice()}{51}{subsubsection.4.6.2.12}}
\gdef \LT@xlix {\LT@entry 
    {3}{36.30759pt}\LT@entry 
    {3}{196.48192pt}}
\@writefile{toc}{\contentsline {section}{\numberline {4.7}R\IeC {\'e}f\IeC {\'e}rence du fichier src/utils.c}{52}{section.4.7}}
\newlabel{utils_8c}{{4.7}{52}{Référence du fichier src/utils.c}{section.4.7}{}}
\gdef \LT@l {\LT@entry 
    {3}{37.57649pt}\LT@entry 
    {3}{135.40028pt}}
\@writefile{toc}{\contentsline {subsection}{\numberline {4.7.1}Description d\IeC {\'e}taill\IeC {\'e}e}{53}{subsection.4.7.1}}
\@writefile{toc}{\contentsline {subsection}{\numberline {4.7.2}Documentation des fonctions}{53}{subsection.4.7.2}}
\newlabel{utils_8c_a3b7908e8916a52b84521dfee1c9fa0d3}{{4.7.2}{53}{Documentation des fonctions}{subsection.4.7.2}{}}
\@writefile{toc}{\contentsline {subsubsection}{\numberline {4.7.2.1}binary\_to\_decimal()}{53}{subsubsection.4.7.2.1}}
\gdef \LT@li {\LT@entry 
    {3}{45.81134pt}\LT@entry 
    {3}{175.20663pt}}
\newlabel{utils_8c_a24de25c90e051b42fa3d59a7814b0b7c}{{4.7.2.1}{54}{\texorpdfstring {binary\_to\_decimal()}{binary\_to\_decimal()}}{figure.caption.80}{}}
\@writefile{toc}{\contentsline {subsubsection}{\numberline {4.7.2.2}decimal\_to\_binary()}{54}{subsubsection.4.7.2.2}}
\@writefile{toc}{\contentsline {chapter}{Index}{55}{section*.82}}
