%YAML 1.1
%TAG !u! tag:unity3d.com,2011:
--- !u!29 &1
OcclusionCullingSettings:
  m_ObjectHideFlags: 0
  serializedVersion: 2
  m_OcclusionBakeSettings:
    smallestOccluder: 5
    smallestHole: 0.25
    backfaceThreshold: 100
  m_SceneGUID: 00000000000000000000000000000000
  m_OcclusionCullingData: {fileID: 0}
--- !u!104 &2
RenderSettings:
  m_ObjectHideFlags: 0
  serializedVersion: 9
  m_Fog: 0
  m_FogColor: {r: 0.5, g: 0.5, b: 0.5, a: 1}
  m_FogMode: 3
  m_FogDensity: 0.01
  m_LinearFogStart: 0
  m_LinearFogEnd: 300
  m_AmbientSkyColor: {r: 0.212, g: 0.227, b: 0.259, a: 1}
  m_AmbientEquatorColor: {r: 0.114, g: 0.125, b: 0.133, a: 1}
  m_AmbientGroundColor: {r: 0.047, g: 0.043, b: 0.035, a: 1}
  m_AmbientIntensity: 1
  m_AmbientMode: 0
  m_SubtractiveShadowColor: {r: 0.42, g: 0.478, b: 0.627, a: 1}
  m_SkyboxMaterial: {fileID: 2100000, guid: 2c308a3b06c530748acc49e5e317ee58, type: 2}
  m_HaloStrength: 0.5
  m_FlareStrength: 1
  m_FlareFadeSpeed: 3
  m_HaloTexture: {fileID: 0}
  m_SpotCookie: {fileID: 10001, guid: 0000000000000000e000000000000000, type: 0}
  m_DefaultReflectionMode: 0
  m_DefaultReflectionResolution: 128
  m_ReflectionBounces: 1
  m_ReflectionIntensity: 1
  m_CustomReflection: {fileID: 0}
  m_Sun: {fileID: 0}
  m_IndirectSpecularColor: {r: 0, g: 0, b: 0, a: 1}
  m_UseRadianceAmbientProbe: 0
--- !u!157 &4
LightmapSettings:
  m_ObjectHideFlags: 0
  serializedVersion: 12
  m_GIWorkflowMode: 0
  m_GISettings:
    serializedVersion: 2
    m_BounceScale: 1
    m_IndirectOutputScale: 1
    m_AlbedoBoost: 1
    m_EnvironmentLightingMode: 0
    m_EnableBakedLightmaps: 1
    m_EnableRealtimeLightmaps: 1
  m_LightmapEditorSettings:
    serializedVersion: 12
    m_Resolution: 2
    m_BakeResolution: 40
    m_AtlasSize: 1024
    m_AO: 0
    m_AOMaxDistance: 1
    m_CompAOExponent: 0
    m_CompAOExponentDirect: 0
    m_ExtractAmbientOcclusion: 0
    m_Padding: 2
    m_LightmapParameters: {fileID: 0}
    m_LightmapsBakeMode: 1
    m_TextureCompression: 1
    m_FinalGather: 0
    m_FinalGatherFiltering: 1
    m_FinalGatherRayCount: 1024
    m_ReflectionCompression: 2
    m_MixedBakeMode: 1
    m_BakeBackend: 0
    m_PVRSampling: 1
    m_PVRDirectSampleCount: 32
    m_PVRSampleCount: 512
    m_PVRBounces: 2
    m_PVREnvironmentSampleCount: 512
    m_PVREnvironmentReferencePointCount: 2048
    m_PVRFilteringMode: 0
    m_PVRDenoiserTypeDirect: 0
    m_PVRDenoiserTypeIndirect: 0
    m_PVRDenoiserTypeAO: 0
    m_PVRFilterTypeDirect: 0
    m_PVRFilterTypeIndirect: 0
    m_PVRFilterTypeAO: 0
    m_PVREnvironmentMIS: 0
    m_PVRCulling: 1
    m_PVRFilteringGaussRadiusDirect: 1
    m_PVRFilteringGaussRadiusIndirect: 5
    m_PVRFilteringGaussRadiusAO: 2
    m_PVRFilteringAtrousPositionSigmaDirect: 0.5
    m_PVRFilteringAtrousPositionSigmaIndirect: 2
    m_PVRFilteringAtrousPositionSigmaAO: 1
    m_ExportTrainingData: 0
    m_TrainingDataDestination: TrainingData
    m_LightProbeSampleCountMultiplier: 4
  m_LightingDataAsset: {fileID: 0}
  m_LightingSettings: {fileID: 4890085278179872738, guid: 23f28d853c6b6354693127f32f454539, type: 2}
--- !u!196 &5
NavMeshSettings:
  serializedVersion: 2
  m_ObjectHideFlags: 0
  m_BuildSettings:
    serializedVersion: 2
    agentTypeID: 0
    agentRadius: 0.5
    agentHeight: 2
    agentSlope: 45
    agentClimb: 0.4
    ledgeDropHeight: 0
    maxJumpAcrossDistance: 0
    minRegionArea: 2
    manualCellSize: 0
    cellSize: 0.16666667
    manualTileSize: 0
    tileSize: 256
    accuratePlacement: 0
    maxJobWorkers: 0
    preserveTilesOutsideBounds: 0
    debug:
      m_Flags: 0
  m_NavMeshData: {fileID: 0}
--- !u!1001 &46107307
PrefabInstance:
  m_ObjectHideFlags: 0
  serializedVersion: 2
  m_Modification:
    m_TransformParent: {fileID: 2060794256}
    m_Modifications:
    - target: {fileID: 486756, guid: e369416ca848b20439557e28d5afc76f, type: 3}
      propertyPath: m_RootOrder
      value: 1
      objectReference: {fileID: 0}
    - target: {fileID: 486756, guid: e369416ca848b20439557e28d5afc76f, type: 3}
      propertyPath: m_LocalScale.x
      value: 1
      objectReference: {fileID: 0}
    - target: {fileID: 486756, guid: e369416ca848b20439557e28d5afc76f, type: 3}
      propertyPath: m_LocalPosition.x
      value: 8
      objectReference: {fileID: 0}
    - target: {fileID: 486756, guid: e369416ca848b20439557e28d5afc76f, type: 3}
      propertyPath: m_LocalPosition.y
      value: 1.42
      objectReference: {fileID: 0}
    - target: {fileID: 486756, guid: e369416ca848b20439557e28d5afc76f, type: 3}
      propertyPath: m_LocalPosition.z
      value: 1.95
      objectReference: {fileID: 0}
    - target: {fileID: 486756, guid: e369416ca848b20439557e28d5afc76f, type: 3}
      propertyPath: m_LocalRotation.w
      value: 0.61237246
      objectReference: {fileID: 0}
    - target: {fileID: 486756, guid: e369416ca848b20439557e28d5afc76f, type: 3}
      propertyPath: m_LocalRotation.x
      value: -0.35355315
      objectReference: {fileID: 0}
    - target: {fileID: 486756, guid: e369416ca848b20439557e28d5afc76f, type: 3}
      propertyPath: m_LocalRotation.y
      value: -0.35355338
      objectReference: {fileID: 0}
    - target: {fileID: 486756, guid: e369416ca848b20439557e28d5afc76f, type: 3}
      propertyPath: m_LocalRotation.z
      value: 0.6123727
      objectReference: {fileID: 0}
    - target: {fileID: 486756, guid: e369416ca848b20439557e28d5afc76f, type: 3}
      propertyPath: m_LocalEulerAnglesHint.y
      value: -60
      objectReference: {fileID: 0}
    m_RemovedComponents: []
  m_SourcePrefab: {fileID: 100100000, guid: e369416ca848b20439557e28d5afc76f, type: 3}
--- !u!1001 &111992728
PrefabInstance:
  m_ObjectHideFlags: 0
  serializedVersion: 2
  m_Modification:
    m_TransformParent: {fileID: 2060794256}
    m_Modifications:
    - target: {fileID: 474176, guid: a88a4088f30993d4aa056af36449cbd2, type: 3}
      propertyPath: m_RootOrder
      value: 10
      objectReference: {fileID: 0}
    - target: {fileID: 474176, guid: a88a4088f30993d4aa056af36449cbd2, type: 3}
      propertyPath: m_LocalPosition.x
      value: -3
      objectReference: {fileID: 0}
    - target: {fileID: 474176, guid: a88a4088f30993d4aa056af36449cbd2, type: 3}
      propertyPath: m_LocalPosition.y
      value: 0.34
      objectReference: {fileID: 0}
    - target: {fileID: 474176, guid: a88a4088f30993d4aa056af36449cbd2, type: 3}
      propertyPath: m_LocalPosition.z
      value: 6.55
      objectReference: {fileID: 0}
    - target: {fileID: 474176, guid: a88a4088f30993d4aa056af36449cbd2, type: 3}
      propertyPath: m_LocalRotation.w
      value: 1
      objectReference: {fileID: 0}
    - target: {fileID: 474176, guid: a88a4088f30993d4aa056af36449cbd2, type: 3}
      propertyPath: m_LocalRotation.x
      value: 0
      objectReference: {fileID: 0}
    - target: {fileID: 474176, guid: a88a4088f30993d4aa056af36449cbd2, type: 3}
      propertyPath: m_LocalRotation.y
      value: 0
      objectReference: {fileID: 0}
    - target: {fileID: 474176, guid: a88a4088f30993d4aa056af36449cbd2, type: 3}
      propertyPath: m_LocalRotation.z
      value: 0
      objectReference: {fileID: 0}
    m_RemovedComponents: []
  m_SourcePrefab: {fileID: 100100000, guid: a88a4088f30993d4aa056af36449cbd2, type: 3}
--- !u!4 &111992729 stripped
Transform:
  m_CorrespondingSourceObject: {fileID: 474176, guid: a88a4088f30993d4aa056af36449cbd2, type: 3}
  m_PrefabInstance: {fileID: 111992728}
  m_PrefabAsset: {fileID: 0}
--- !u!1001 &240096623
PrefabInstance:
  m_ObjectHideFlags: 0
  serializedVersion: 2
  m_Modification:
    m_TransformParent: {fileID: 2060794256}
    m_Modifications:
    - target: {fileID: 481270, guid: c26b84f8b12b03f4d8f03ce1826c0278, type: 3}
      propertyPath: m_RootOrder
      value: 0
      objectReference: {fileID: 0}
    - target: {fileID: 481270, guid: c26b84f8b12b03f4d8f03ce1826c0278, type: 3}
      propertyPath: m_LocalScale.x
      value: 1
      objectReference: {fileID: 0}
    - target: {fileID: 481270, guid: c26b84f8b12b03f4d8f03ce1826c0278, type: 3}
      propertyPath: m_LocalPosition.x
      value: 8
      objectReference: {fileID: 0}
    - target: {fileID: 481270, guid: c26b84f8b12b03f4d8f03ce1826c0278, type: 3}
      propertyPath: m_LocalPosition.y
      value: 1.42
      objectReference: {fileID: 0}
    - target: {fileID: 481270, guid: c26b84f8b12b03f4d8f03ce1826c0278, type: 3}
      propertyPath: m_LocalPosition.z
      value: 6.45
      objectReference: {fileID: 0}
    - target: {fileID: 481270, guid: c26b84f8b12b03f4d8f03ce1826c0278, type: 3}
      propertyPath: m_LocalRotation.w
      value: 0.4999999
      objectReference: {fileID: 0}
    - target: {fileID: 481270, guid: c26b84f8b12b03f4d8f03ce1826c0278, type: 3}
      propertyPath: m_LocalRotation.x
      value: -0.49999973
      objectReference: {fileID: 0}
    - target: {fileID: 481270, guid: c26b84f8b12b03f4d8f03ce1826c0278, type: 3}
      propertyPath: m_LocalRotation.y
      value: -0.5000001
      objectReference: {fileID: 0}
    - target: {fileID: 481270, guid: c26b84f8b12b03f4d8f03ce1826c0278, type: 3}
      propertyPath: m_LocalRotation.z
      value: 0.50000024
      objectReference: {fileID: 0}
    - target: {fileID: 481270, guid: c26b84f8b12b03f4d8f03ce1826c0278, type: 3}
      propertyPath: m_LocalEulerAnglesHint.y
      value: -90
      objectReference: {fileID: 0}
    m_RemovedComponents: []
  m_SourcePrefab: {fileID: 100100000, guid: c26b84f8b12b03f4d8f03ce1826c0278, type: 3}
--- !u!1001 &310046065
PrefabInstance:
  m_ObjectHideFlags: 0
  serializedVersion: 2
  m_Modification:
    m_TransformParent: {fileID: 2060794256}
    m_Modifications:
    - target: {fileID: 410940, guid: 6749a1da7a6538e4bae6c320db525d94, type: 3}
      propertyPath: m_RootOrder
      value: 15
      objectReference: {fileID: 0}
    - target: {fileID: 410940, guid: 6749a1da7a6538e4bae6c320db525d94, type: 3}
      propertyPath: m_LocalScale.y
      value: 1
      objectReference: {fileID: 0}
    - target: {fileID: 410940, guid: 6749a1da7a6538e4bae6c320db525d94, type: 3}
      propertyPath: m_LocalScale.z
      value: 1
      objectReference: {fileID: 0}
    - target: {fileID: 410940, guid: 6749a1da7a6538e4bae6c320db525d94, type: 3}
      propertyPath: m_LocalPosition.x
      value: -7.83
      objectReference: {fileID: 0}
    - target: {fileID: 410940, guid: 6749a1da7a6538e4bae6c320db525d94, type: 3}
      propertyPath: m_LocalPosition.y
      value: 1.54
      objectReference: {fileID: 0}
    - target: {fileID: 410940, guid: 6749a1da7a6538e4bae6c320db525d94, type: 3}
      propertyPath: m_LocalPosition.z
      value: -6.55
      objectReference: {fileID: 0}
    - target: {fileID: 410940, guid: 6749a1da7a6538e4bae6c320db525d94, type: 3}
      propertyPath: m_LocalRotation.w
      value: 0
      objectReference: {fileID: 0}
    - target: {fileID: 410940, guid: 6749a1da7a6538e4bae6c320db525d94, type: 3}
      propertyPath: m_LocalRotation.x
      value: -1
      objectReference: {fileID: 0}
    - target: {fileID: 410940, guid: 6749a1da7a6538e4bae6c320db525d94, type: 3}
      propertyPath: m_LocalRotation.y
      value: 0
      objectReference: {fileID: 0}
    - target: {fileID: 410940, guid: 6749a1da7a6538e4bae6c320db525d94, type: 3}
      propertyPath: m_LocalRotation.z
      value: 0
      objectReference: {fileID: 0}
    - target: {fileID: 410940, guid: 6749a1da7a6538e4bae6c320db525d94, type: 3}
      propertyPath: m_LocalEulerAnglesHint.x
      value: 0
      objectReference: {fileID: 0}
    - target: {fileID: 410940, guid: 6749a1da7a6538e4bae6c320db525d94, type: 3}
      propertyPath: m_LocalEulerAnglesHint.y
      value: -180
      objectReference: {fileID: 0}
    - target: {fileID: 410940, guid: 6749a1da7a6538e4bae6c320db525d94, type: 3}
      propertyPath: m_LocalEulerAnglesHint.z
      value: -180
      objectReference: {fileID: 0}
    m_RemovedComponents: []
  m_SourcePrefab: {fileID: 100100000, guid: 6749a1da7a6538e4bae6c320db525d94, type: 3}
--- !u!4 &310046066 stripped
Transform:
  m_CorrespondingSourceObject: {fileID: 410940, guid: 6749a1da7a6538e4bae6c320db525d94, type: 3}
  m_PrefabInstance: {fileID: 310046065}
  m_PrefabAsset: {fileID: 0}
--- !u!4 &312586429 stripped
Transform:
  m_CorrespondingSourceObject: {fileID: 433904, guid: 3f97cdb2dde8d7f44a37ce3a93c2bf69, type: 3}
  m_PrefabInstance: {fileID: 1539807687}
  m_PrefabAsset: {fileID: 0}
--- !u!4 &360592085 stripped
Transform:
  m_CorrespondingSourceObject: {fileID: 488368, guid: 0845aa8b2ce753145ab9bacc42062661, type: 3}
  m_PrefabInstance: {fileID: 383321848}
  m_PrefabAsset: {fileID: 0}
--- !u!1001 &383321848
PrefabInstance:
  m_ObjectHideFlags: 0
  serializedVersion: 2
  m_Modification:
    m_TransformParent: {fileID: 2060794256}
    m_Modifications:
    - target: {fileID: 488368, guid: 0845aa8b2ce753145ab9bacc42062661, type: 3}
      propertyPath: m_RootOrder
      value: 3
      objectReference: {fileID: 0}
    - target: {fileID: 488368, guid: 0845aa8b2ce753145ab9bacc42062661, type: 3}
      propertyPath: m_LocalScale.x
      value: 1
      objectReference: {fileID: 0}
    - target: {fileID: 488368, guid: 0845aa8b2ce753145ab9bacc42062661, type: 3}
      propertyPath: m_LocalPosition.x
      value: 8
      objectReference: {fileID: 0}
    - target: {fileID: 488368, guid: 0845aa8b2ce753145ab9bacc42062661, type: 3}
      propertyPath: m_LocalPosition.y
      value: 1.42
      objectReference: {fileID: 0}
    - target: {fileID: 488368, guid: 0845aa8b2ce753145ab9bacc42062661, type: 3}
      propertyPath: m_LocalPosition.z
      value: -6.55
      objectReference: {fileID: 0}
    - target: {fileID: 488368, guid: 0845aa8b2ce753145ab9bacc42062661, type: 3}
      propertyPath: m_LocalRotation.w
      value: 0.70710665
      objectReference: {fileID: 0}
    - target: {fileID: 488368, guid: 0845aa8b2ce753145ab9bacc42062661, type: 3}
      propertyPath: m_LocalRotation.x
      value: 0
      objectReference: {fileID: 0}
    - target: {fileID: 488368, guid: 0845aa8b2ce753145ab9bacc42062661, type: 3}
      propertyPath: m_LocalRotation.y
      value: 0
      objectReference: {fileID: 0}
    - target: {fileID: 488368, guid: 0845aa8b2ce753145ab9bacc42062661, type: 3}
      propertyPath: m_LocalRotation.z
      value: 0.707107
      objectReference: {fileID: 0}
    m_RemovedComponents: []
  m_SourcePrefab: {fileID: 100100000, guid: 0845aa8b2ce753145ab9bacc42062661, type: 3}
--- !u!1001 &387374619
PrefabInstance:
  m_ObjectHideFlags: 0
  serializedVersion: 2
  m_Modification:
    m_TransformParent: {fileID: 2060794256}
    m_Modifications:
    - target: {fileID: 477400, guid: 023211deead76c94dad691d75c768a7d, type: 3}
      propertyPath: m_RootOrder
      value: 14
      objectReference: {fileID: 0}
    - target: {fileID: 477400, guid: 023211deead76c94dad691d75c768a7d, type: 3}
      propertyPath: m_LocalScale.y
      value: 1
      objectReference: {fileID: 0}
    - target: {fileID: 477400, guid: 023211deead76c94dad691d75c768a7d, type: 3}
      propertyPath: m_LocalScale.z
      value: 1
      objectReference: {fileID: 0}
    - target: {fileID: 477400, guid: 023211deead76c94dad691d75c768a7d, type: 3}
      propertyPath: m_LocalPosition.x
      value: -7.8
      objectReference: {fileID: 0}
    - target: {fileID: 477400, guid: 023211deead76c94dad691d75c768a7d, type: 3}
      propertyPath: m_LocalPosition.y
      value: 1.54
      objectReference: {fileID: 0}
    - target: {fileID: 477400, guid: 023211deead76c94dad691d75c768a7d, type: 3}
      propertyPath: m_LocalPosition.z
      value: 6.55
      objectReference: {fileID: 0}
    - target: {fileID: 477400, guid: 023211deead76c94dad691d75c768a7d, type: 3}
      propertyPath: m_LocalRotation.w
      value: 0
      objectReference: {fileID: 0}
    - target: {fileID: 477400, guid: 023211deead76c94dad691d75c768a7d, type: 3}
      propertyPath: m_LocalRotation.x
      value: -1
      objectReference: {fileID: 0}
    - target: {fileID: 477400, guid: 023211deead76c94dad691d75c768a7d, type: 3}
      propertyPath: m_LocalRotation.y
      value: 0
      objectReference: {fileID: 0}
    - target: {fileID: 477400, guid: 023211deead76c94dad691d75c768a7d, type: 3}
      propertyPath: m_LocalRotation.z
      value: 0
      objectReference: {fileID: 0}
    - target: {fileID: 477400, guid: 023211deead76c94dad691d75c768a7d, type: 3}
      propertyPath: m_LocalEulerAnglesHint.x
      value: 0
      objectReference: {fileID: 0}
    - target: {fileID: 477400, guid: 023211deead76c94dad691d75c768a7d, type: 3}
      propertyPath: m_LocalEulerAnglesHint.y
      value: -180
      objectReference: {fileID: 0}
    - target: {fileID: 477400, guid: 023211deead76c94dad691d75c768a7d, type: 3}
      propertyPath: m_LocalEulerAnglesHint.z
      value: -180
      objectReference: {fileID: 0}
    m_RemovedComponents: []
  m_SourcePrefab: {fileID: 100100000, guid: 023211deead76c94dad691d75c768a7d, type: 3}
--- !u!4 &387374620 stripped
Transform:
  m_CorrespondingSourceObject: {fileID: 477400, guid: 023211deead76c94dad691d75c768a7d, type: 3}
  m_PrefabInstance: {fileID: 387374619}
  m_PrefabAsset: {fileID: 0}
--- !u!1001 &400782304
PrefabInstance:
  m_ObjectHideFlags: 0
  serializedVersion: 2
  m_Modification:
    m_TransformParent: {fileID: 2060794256}
    m_Modifications:
    - target: {fileID: 495450, guid: d02101df497c74a43a80cd5097338022, type: 3}
      propertyPath: m_RootOrder
      value: 4
      objectReference: {fileID: 0}
    - target: {fileID: 495450, guid: d02101df497c74a43a80cd5097338022, type: 3}
      propertyPath: m_LocalPosition.x
      value: 3.25
      objectReference: {fileID: 0}
    - target: {fileID: 495450, guid: d02101df497c74a43a80cd5097338022, type: 3}
      propertyPath: m_LocalPosition.y
      value: 0.34
      objectReference: {fileID: 0}
    - target: {fileID: 495450, guid: d02101df497c74a43a80cd5097338022, type: 3}
      propertyPath: m_LocalPosition.z
      value: 6.45
      objectReference: {fileID: 0}
    - target: {fileID: 495450, guid: d02101df497c74a43a80cd5097338022, type: 3}
      propertyPath: m_LocalRotation.w
      value: 1
      objectReference: {fileID: 0}
    - target: {fileID: 495450, guid: d02101df497c74a43a80cd5097338022, type: 3}
      propertyPath: m_LocalRotation.x
      value: 0
      objectReference: {fileID: 0}
    - target: {fileID: 495450, guid: d02101df497c74a43a80cd5097338022, type: 3}
      propertyPath: m_LocalRotation.y
      value: 0
      objectReference: {fileID: 0}
    - target: {fileID: 495450, guid: d02101df497c74a43a80cd5097338022, type: 3}
      propertyPath: m_LocalRotation.z
      value: 0
      objectReference: {fileID: 0}
    m_RemovedComponents: []
  m_SourcePrefab: {fileID: 100100000, guid: d02101df497c74a43a80cd5097338022, type: 3}
--- !u!1001 &456646400
PrefabInstance:
  m_ObjectHideFlags: 0
  serializedVersion: 2
  m_Modification:
    m_TransformParent: {fileID: 0}
    m_Modifications:
    - target: {fileID: 153648, guid: 696a93e0e2eb398428d7b5be3f360be6, type: 3}
      propertyPath: m_IsActive
      value: 1
      objectReference: {fileID: 0}
    - target: {fileID: 22431090, guid: 696a93e0e2eb398428d7b5be3f360be6, type: 3}
      propertyPath: m_Pivot.x
      value: 0
      objectReference: {fileID: 0}
    - target: {fileID: 22431090, guid: 696a93e0e2eb398428d7b5be3f360be6, type: 3}
      propertyPath: m_Pivot.y
      value: 0
      objectReference: {fileID: 0}
    - target: {fileID: 22431090, guid: 696a93e0e2eb398428d7b5be3f360be6, type: 3}
      propertyPath: m_RootOrder
      value: 5
      objectReference: {fileID: 0}
    - target: {fileID: 22431090, guid: 696a93e0e2eb398428d7b5be3f360be6, type: 3}
      propertyPath: m_AnchorMax.x
      value: 0
      objectReference: {fileID: 0}
    - target: {fileID: 22431090, guid: 696a93e0e2eb398428d7b5be3f360be6, type: 3}
      propertyPath: m_AnchorMax.y
      value: 0
      objectReference: {fileID: 0}
    - target: {fileID: 22431090, guid: 696a93e0e2eb398428d7b5be3f360be6, type: 3}
      propertyPath: m_AnchorMin.x
      value: 0
      objectReference: {fileID: 0}
    - target: {fileID: 22431090, guid: 696a93e0e2eb398428d7b5be3f360be6, type: 3}
      propertyPath: m_AnchorMin.y
      value: 0
      objectReference: {fileID: 0}
    - target: {fileID: 22431090, guid: 696a93e0e2eb398428d7b5be3f360be6, type: 3}
      propertyPath: m_SizeDelta.x
      value: 0
      objectReference: {fileID: 0}
    - target: {fileID: 22431090, guid: 696a93e0e2eb398428d7b5be3f360be6, type: 3}
      propertyPath: m_SizeDelta.y
      value: 0
      objectReference: {fileID: 0}
    - target: {fileID: 22431090, guid: 696a93e0e2eb398428d7b5be3f360be6, type: 3}
      propertyPath: m_LocalPosition.x
      value: 0
      objectReference: {fileID: 0}
    - target: {fileID: 22431090, guid: 696a93e0e2eb398428d7b5be3f360be6, type: 3}
      propertyPath: m_LocalPosition.y
      value: 0
      objectReference: {fileID: 0}
    - target: {fileID: 22431090, guid: 696a93e0e2eb398428d7b5be3f360be6, type: 3}
      propertyPath: m_LocalPosition.z
      value: 0
      objectReference: {fileID: 0}
    - target: {fileID: 22431090, guid: 696a93e0e2eb398428d7b5be3f360be6, type: 3}
      propertyPath: m_LocalRotation.w
      value: 1
      objectReference: {fileID: 0}
    - target: {fileID: 22431090, guid: 696a93e0e2eb398428d7b5be3f360be6, type: 3}
      propertyPath: m_LocalRotation.x
      value: 0
      objectReference: {fileID: 0}
    - target: {fileID: 22431090, guid: 696a93e0e2eb398428d7b5be3f360be6, type: 3}
      propertyPath: m_LocalRotation.y
      value: 0
      objectReference: {fileID: 0}
    - target: {fileID: 22431090, guid: 696a93e0e2eb398428d7b5be3f360be6, type: 3}
      propertyPath: m_LocalRotation.z
      value: 0
      objectReference: {fileID: 0}
    - target: {fileID: 22431090, guid: 696a93e0e2eb398428d7b5be3f360be6, type: 3}
      propertyPath: m_AnchoredPosition.x
      value: 0
      objectReference: {fileID: 0}
    - target: {fileID: 22431090, guid: 696a93e0e2eb398428d7b5be3f360be6, type: 3}
      propertyPath: m_AnchoredPosition.y
      value: 0
      objectReference: {fileID: 0}
    m_RemovedComponents: []
  m_SourcePrefab: {fileID: 100100000, guid: 696a93e0e2eb398428d7b5be3f360be6, type: 3}
--- !u!1001 &700823224
PrefabInstance:
  m_ObjectHideFlags: 0
  serializedVersion: 2
  m_Modification:
    m_TransformParent: {fileID: 2060794256}
    m_Modifications:
    - target: {fileID: 433370, guid: 47a210ee634dacf4fb58161669eac2b4, type: 3}
      propertyPath: m_RootOrder
      value: 8
      objectReference: {fileID: 0}
    - target: {fileID: 433370, guid: 47a210ee634dacf4fb58161669eac2b4, type: 3}
      propertyPath: m_LocalPosition.x
      value: -3
      objectReference: {fileID: 0}
    - target: {fileID: 433370, guid: 47a210ee634dacf4fb58161669eac2b4, type: 3}
      propertyPath: m_LocalPosition.y
      value: 0.34
      objectReference: {fileID: 0}
    - target: {fileID: 433370, guid: 47a210ee634dacf4fb58161669eac2b4, type: 3}
      propertyPath: m_LocalPosition.z
      value: 1.97
      objectReference: {fileID: 0}
    - target: {fileID: 433370, guid: 47a210ee634dacf4fb58161669eac2b4, type: 3}
      propertyPath: m_LocalRotation.w
      value: 1
      objectReference: {fileID: 0}
    - target: {fileID: 433370, guid: 47a210ee634dacf4fb58161669eac2b4, type: 3}
      propertyPath: m_LocalRotation.x
      value: 0
      objectReference: {fileID: 0}
    - target: {fileID: 433370, guid: 47a210ee634dacf4fb58161669eac2b4, type: 3}
      propertyPath: m_LocalRotation.y
      value: 0
      objectReference: {fileID: 0}
    - target: {fileID: 433370, guid: 47a210ee634dacf4fb58161669eac2b4, type: 3}
      propertyPath: m_LocalRotation.z
      value: 0
      objectReference: {fileID: 0}
    m_RemovedComponents: []
  m_SourcePrefab: {fileID: 100100000, guid: 47a210ee634dacf4fb58161669eac2b4, type: 3}
--- !u!4 &700823225 stripped
Transform:
  m_CorrespondingSourceObject: {fileID: 433370, guid: 47a210ee634dacf4fb58161669eac2b4, type: 3}
  m_PrefabInstance: {fileID: 700823224}
  m_PrefabAsset: {fileID: 0}
--- !u!1 &716246327
GameObject:
  m_ObjectHideFlags: 0
  m_CorrespondingSourceObject: {fileID: 132264, guid: 3fb4b74fb453ece4e85885b0787500f7, type: 2}
  m_PrefabInstance: {fileID: 0}
  m_PrefabAsset: {fileID: 0}
  serializedVersion: 6
  m_Component:
  - component: {fileID: 716246329}
  - component: {fileID: 716246328}
  m_Layer: 0
  m_Name: Point light
  m_TagString: Untagged
  m_Icon: {fileID: 0}
  m_NavMeshLayer: 0
  m_StaticEditorFlags: 4294967295
  m_IsActive: 1
--- !u!108 &716246328
Light:
  m_ObjectHideFlags: 0
  m_CorrespondingSourceObject: {fileID: 10855476, guid: 3fb4b74fb453ece4e85885b0787500f7, type: 2}
  m_PrefabInstance: {fileID: 0}
  m_PrefabAsset: {fileID: 0}
  m_GameObject: {fileID: 716246327}
  m_Enabled: 1
  serializedVersion: 10
  m_Type: 2
  m_Shape: 0
  m_Color: {r: 0.1694961, g: 0.43583688, b: 0.6985294, a: 1}
  m_Intensity: 8
  m_Range: 35
  m_SpotAngle: 30
  m_InnerSpotAngle: 21.80208
  m_CookieSize: 10
  m_Shadows:
    m_Type: 0
    m_Resolution: -1
    m_CustomResolution: -1
    m_Strength: 1
    m_Bias: 0.05
    m_NormalBias: 0.4
    m_NearPlane: 0.2
    m_CullingMatrixOverride:
      e00: 1
      e01: 0
      e02: 0
      e03: 0
      e10: 0
      e11: 1
      e12: 0
      e13: 0
      e20: 0
      e21: 0
      e22: 1
      e23: 0
      e30: 0
      e31: 0
      e32: 0
      e33: 1
    m_UseCullingMatrixOverride: 0
  m_Cookie: {fileID: 0}
  m_DrawHalo: 0
  m_Flare: {fileID: 0}
  m_RenderMode: 0
  m_CullingMask:
    serializedVersion: 2
    m_Bits: 4294967295
  m_RenderingLayerMask: 1
  m_Lightmapping: 4
  m_LightShadowCasterMode: 0
  m_AreaSize: {x: 1, y: 1}
  m_BounceIntensity: 1
  m_ColorTemperature: 6570
  m_UseColorTemperature: 0
  m_BoundingSphereOverride: {x: 0, y: 0, z: 0, w: 0}
  m_UseBoundingSphereOverride: 0
  m_UseViewFrustumForShadowCasterCull: 1
  m_ShadowRadius: 0
  m_ShadowAngle: 0
--- !u!4 &716246329
Transform:
  m_ObjectHideFlags: 0
  m_CorrespondingSourceObject: {fileID: 461344, guid: 3fb4b74fb453ece4e85885b0787500f7, type: 2}
  m_PrefabInstance: {fileID: 0}
  m_PrefabAsset: {fileID: 0}
  m_GameObject: {fileID: 716246327}
  m_LocalRotation: {x: 0, y: 0, z: 0, w: 1}
  m_LocalPosition: {x: 0, y: 6, z: 0}
  m_LocalScale: {x: 1, y: 1, z: 1}
  m_Children: []
  m_Father: {fileID: 0}
  m_RootOrder: 2
  m_LocalEulerAnglesHint: {x: 0, y: 0, z: 0}
--- !u!4 &811385979 stripped
Transform:
  m_CorrespondingSourceObject: {fileID: 406902, guid: 11943dcb81a97804fbd4b58ce063f22b, type: 3}
  m_PrefabInstance: {fileID: 1899473989}
  m_PrefabAsset: {fileID: 0}
--- !u!1001 &945764670
PrefabInstance:
  m_ObjectHideFlags: 0
  serializedVersion: 2
  m_Modification:
    m_TransformParent: {fileID: 2060794256}
    m_Modifications:
    - target: {fileID: 415458, guid: 7d5bdfc07d77aab4a963e018ba7bccc4, type: 3}
      propertyPath: m_RootOrder
      value: 9
      objectReference: {fileID: 0}
    - target: {fileID: 415458, guid: 7d5bdfc07d77aab4a963e018ba7bccc4, type: 3}
      propertyPath: m_LocalPosition.x
      value: -3
      objectReference: {fileID: 0}
    - target: {fileID: 415458, guid: 7d5bdfc07d77aab4a963e018ba7bccc4, type: 3}
      propertyPath: m_LocalPosition.y
      value: 0.34
      objectReference: {fileID: 0}
    - target: {fileID: 415458, guid: 7d5bdfc07d77aab4a963e018ba7bccc4, type: 3}
      propertyPath: m_LocalPosition.z
      value: -2.25
      objectReference: {fileID: 0}
    - target: {fileID: 415458, guid: 7d5bdfc07d77aab4a963e018ba7bccc4, type: 3}
      propertyPath: m_LocalRotation.w
      value: 1
      objectReference: {fileID: 0}
    - target: {fileID: 415458, guid: 7d5bdfc07d77aab4a963e018ba7bccc4, type: 3}
      propertyPath: m_LocalRotation.x
      value: 0
      objectReference: {fileID: 0}
    - target: {fileID: 415458, guid: 7d5bdfc07d77aab4a963e018ba7bccc4, type: 3}
      propertyPath: m_LocalRotation.y
      value: 0
      objectReference: {fileID: 0}
    - target: {fileID: 415458, guid: 7d5bdfc07d77aab4a963e018ba7bccc4, type: 3}
      propertyPath: m_LocalRotation.z
      value: 0
      objectReference: {fileID: 0}
    m_RemovedComponents: []
  m_SourcePrefab: {fileID: 100100000, guid: 7d5bdfc07d77aab4a963e018ba7bccc4, type: 3}
--- !u!4 &945764671 stripped
Transform:
  m_CorrespondingSourceObject: {fileID: 415458, guid: 7d5bdfc07d77aab4a963e018ba7bccc4, type: 3}
  m_PrefabInstance: {fileID: 945764670}
  m_PrefabAsset: {fileID: 0}
--- !u!4 &958992867 stripped
Transform:
  m_CorrespondingSourceObject: {fileID: 495450, guid: d02101df497c74a43a80cd5097338022, type: 3}
  m_PrefabInstance: {fileID: 400782304}
  m_PrefabAsset: {fileID: 0}
--- !u!1001 &1293564144
PrefabInstance:
  m_ObjectHideFlags: 0
  serializedVersion: 2
  m_Modification:
    m_TransformParent: {fileID: 0}
    m_Modifications:
    - target: {fileID: 457580, guid: 0fc2dd08d13acab428cf8f7ef9e9ef90, type: 3}
      propertyPath: m_RootOrder
      value: 5
      objectReference: {fileID: 0}
    - target: {fileID: 457580, guid: 0fc2dd08d13acab428cf8f7ef9e9ef90, type: 3}
      propertyPath: m_LocalPosition.x
      value: 0
      objectReference: {fileID: 0}
    - target: {fileID: 457580, guid: 0fc2dd08d13acab428cf8f7ef9e9ef90, type: 3}
      propertyPath: m_LocalPosition.y
      value: 0
      objectReference: {fileID: 0}
    - target: {fileID: 457580, guid: 0fc2dd08d13acab428cf8f7ef9e9ef90, type: 3}
      propertyPath: m_LocalPosition.z
      value: 0
      objectReference: {fileID: 0}
    - target: {fileID: 457580, guid: 0fc2dd08d13acab428cf8f7ef9e9ef90, type: 3}
      propertyPath: m_LocalRotation.w
      value: 1
      objectReference: {fileID: 0}
    - target: {fileID: 457580, guid: 0fc2dd08d13acab428cf8f7ef9e9ef90, type: 3}
      propertyPath: m_LocalRotation.x
      value: 0
      objectReference: {fileID: 0}
    - target: {fileID: 457580, guid: 0fc2dd08d13acab428cf8f7ef9e9ef90, type: 3}
      propertyPath: m_LocalRotation.y
      value: 0
      objectReference: {fileID: 0}
    - target: {fileID: 457580, guid: 0fc2dd08d13acab428cf8f7ef9e9ef90, type: 3}
      propertyPath: m_LocalRotation.z
      value: 0
      objectReference: {fileID: 0}
    m_RemovedComponents: []
  m_SourcePrefab: {fileID: 100100000, guid: 0fc2dd08d13acab428cf8f7ef9e9ef90, type: 3}
--- !u!1001 &1364859960
PrefabInstance:
  m_ObjectHideFlags: 0
  serializedVersion: 2
  m_Modification:
    m_TransformParent: {fileID: 2060794256}
    m_Modifications:
    - target: {fileID: 471988, guid: 79cd481c8e7a27a44ba9a78fbb16b903, type: 3}
      propertyPath: m_RootOrder
      value: 7
      objectReference: {fileID: 0}
    - target: {fileID: 471988, guid: 79cd481c8e7a27a44ba9a78fbb16b903, type: 3}
      propertyPath: m_LocalPosition.x
      value: 3.25
      objectReference: {fileID: 0}
    - target: {fileID: 471988, guid: 79cd481c8e7a27a44ba9a78fbb16b903, type: 3}
      propertyPath: m_LocalPosition.y
      value: 0.34
      objectReference: {fileID: 0}
    - target: {fileID: 471988, guid: 79cd481c8e7a27a44ba9a78fbb16b903, type: 3}
      propertyPath: m_LocalPosition.z
      value: -6.55
      objectReference: {fileID: 0}
    - target: {fileID: 471988, guid: 79cd481c8e7a27a44ba9a78fbb16b903, type: 3}
      propertyPath: m_LocalRotation.w
      value: 1
      objectReference: {fileID: 0}
    - target: {fileID: 471988, guid: 79cd481c8e7a27a44ba9a78fbb16b903, type: 3}
      propertyPath: m_LocalRotation.x
      value: 0
      objectReference: {fileID: 0}
    - target: {fileID: 471988, guid: 79cd481c8e7a27a44ba9a78fbb16b903, type: 3}
      propertyPath: m_LocalRotation.y
      value: 0
      objectReference: {fileID: 0}
    - target: {fileID: 471988, guid: 79cd481c8e7a27a44ba9a78fbb16b903, type: 3}
      propertyPath: m_LocalRotation.z
      value: 0
      objectReference: {fileID: 0}
    m_RemovedComponents: []
  m_SourcePrefab: {fileID: 100100000, guid: 79cd481c8e7a27a44ba9a78fbb16b903, type: 3}
--- !u!1 &1469812817
GameObject:
  m_ObjectHideFlags: 0
  m_CorrespondingSourceObject: {fileID: 0}
  m_PrefabInstance: {fileID: 0}
  m_PrefabAsset: {fileID: 0}
  serializedVersion: 6
  m_Component:
  - component: {fileID: 1469812821}
  - component: {fileID: 1469812820}
  - component: {fileID: 1469812819}
  - component: {fileID: 1469812818}
  m_Layer: 0
  m_Name: Quad
  m_TagString: Untagged
  m_Icon: {fileID: 0}
  m_NavMeshLayer: 0
  m_StaticEditorFlags: 0
  m_IsActive: 1
--- !u!23 &1469812818
MeshRenderer:
  m_ObjectHideFlags: 0
  m_CorrespondingSourceObject: {fileID: 0}
  m_PrefabInstance: {fileID: 0}
  m_PrefabAsset: {fileID: 0}
  m_GameObject: {fileID: 1469812817}
  m_Enabled: 1
  m_CastShadows: 1
  m_ReceiveShadows: 1
  m_DynamicOccludee: 1
  m_MotionVectors: 1
  m_LightProbeUsage: 1
  m_ReflectionProbeUsage: 1
  m_RayTracingMode: 2
  m_RayTraceProcedural: 0
  m_RenderingLayerMask: 1
  m_RendererPriority: 0
  m_Materials:
  - {fileID: 2100000, guid: 5f96383263013ab439e00cec0f0d2255, type: 2}
  m_StaticBatchInfo:
    firstSubMesh: 0
    subMeshCount: 0
  m_StaticBatchRoot: {fileID: 0}
  m_ProbeAnchor: {fileID: 0}
  m_LightProbeVolumeOverride: {fileID: 0}
  m_ScaleInLightmap: 1
  m_ReceiveGI: 1
  m_PreserveUVs: 1
  m_IgnoreNormalsForChartDetection: 0
  m_ImportantGI: 0
  m_StitchLightmapSeams: 1
  m_SelectedEditorRenderState: 3
  m_MinimumChartSize: 4
  m_AutoUVMaxDistance: 0.5
  m_AutoUVMaxAngle: 89
  m_LightmapParameters: {fileID: 0}
  m_SortingLayerID: 0
  m_SortingLayer: 0
  m_SortingOrder: 0
  m_AdditionalVertexStreams: {fileID: 0}
--- !u!64 &1469812819
MeshCollider:
  m_ObjectHideFlags: 0
  m_CorrespondingSourceObject: {fileID: 0}
  m_PrefabInstance: {fileID: 0}
  m_PrefabAsset: {fileID: 0}
  m_GameObject: {fileID: 1469812817}
  m_Material: {fileID: 0}
  m_IsTrigger: 0
  m_Enabled: 1
  serializedVersion: 4
  m_Convex: 0
  m_CookingOptions: 30
  m_Mesh: {fileID: 10210, guid: 0000000000000000e000000000000000, type: 0}
--- !u!33 &1469812820
MeshFilter:
  m_ObjectHideFlags: 0
  m_CorrespondingSourceObject: {fileID: 0}
  m_PrefabInstance: {fileID: 0}
  m_PrefabAsset: {fileID: 0}
  m_GameObject: {fileID: 1469812817}
  m_Mesh: {fileID: 10210, guid: 0000000000000000e000000000000000, type: 0}
--- !u!4 &1469812821
Transform:
  m_ObjectHideFlags: 0
  m_CorrespondingSourceObject: {fileID: 0}
  m_PrefabInstance: {fileID: 0}
  m_PrefabAsset: {fileID: 0}
  m_GameObject: {fileID: 1469812817}
  m_LocalRotation: {x: 0.707107, y: 0, z: 0, w: 0.70710665}
  m_LocalPosition: {x: 0, y: 0, z: 0}
  m_LocalScale: {x: 25, y: 25, z: 25}
  m_Children: []
  m_Father: {fileID: 0}
  m_RootOrder: 1
  m_LocalEulerAnglesHint: {x: 90, y: 0, z: 0}
--- !u!1001 &1539807687
PrefabInstance:
  m_ObjectHideFlags: 0
  serializedVersion: 2
  m_Modification:
    m_TransformParent: {fileID: 2060794256}
    m_Modifications:
    - target: {fileID: 433904, guid: 3f97cdb2dde8d7f44a37ce3a93c2bf69, type: 3}
      propertyPath: m_RootOrder
      value: 6
      objectReference: {fileID: 0}
    - target: {fileID: 433904, guid: 3f97cdb2dde8d7f44a37ce3a93c2bf69, type: 3}
      propertyPath: m_LocalPosition.x
      value: 3.25
      objectReference: {fileID: 0}
    - target: {fileID: 433904, guid: 3f97cdb2dde8d7f44a37ce3a93c2bf69, type: 3}
      propertyPath: m_LocalPosition.y
      value: 0.34
      objectReference: {fileID: 0}
    - target: {fileID: 433904, guid: 3f97cdb2dde8d7f44a37ce3a93c2bf69, type: 3}
      propertyPath: m_LocalPosition.z
      value: -2.3
      objectReference: {fileID: 0}
    - target: {fileID: 433904, guid: 3f97cdb2dde8d7f44a37ce3a93c2bf69, type: 3}
      propertyPath: m_LocalRotation.w
      value: 1
      objectReference: {fileID: 0}
    - target: {fileID: 433904, guid: 3f97cdb2dde8d7f44a37ce3a93c2bf69, type: 3}
      propertyPath: m_LocalRotation.x
      value: 0
      objectReference: {fileID: 0}
    - target: {fileID: 433904, guid: 3f97cdb2dde8d7f44a37ce3a93c2bf69, type: 3}
      propertyPath: m_LocalRotation.y
      value: 0
      objectReference: {fileID: 0}
    - target: {fileID: 433904, guid: 3f97cdb2dde8d7f44a37ce3a93c2bf69, type: 3}
      propertyPath: m_LocalRotation.z
      value: 0
      objectReference: {fileID: 0}
    m_RemovedComponents: []
  m_SourcePrefab: {fileID: 100100000, guid: 3f97cdb2dde8d7f44a37ce3a93c2bf69, type: 3}
--- !u!1001 &1596347855
PrefabInstance:
  m_ObjectHideFlags: 0
  serializedVersion: 2
  m_Modification:
    m_TransformParent: {fileID: 2060794256}
    m_Modifications:
    - target: {fileID: 450930, guid: 5d24c8b5c9abd754d877d25ebd733bdf, type: 3}
      propertyPath: m_RootOrder
      value: 11
      objectReference: {fileID: 0}
    - target: {fileID: 450930, guid: 5d24c8b5c9abd754d877d25ebd733bdf, type: 3}
      propertyPath: m_LocalPosition.x
      value: -3
      objectReference: {fileID: 0}
    - target: {fileID: 450930, guid: 5d24c8b5c9abd754d877d25ebd733bdf, type: 3}
      propertyPath: m_LocalPosition.y
      value: 0.34
      objectReference: {fileID: 0}
    - target: {fileID: 450930, guid: 5d24c8b5c9abd754d877d25ebd733bdf, type: 3}
      propertyPath: m_LocalPosition.z
      value: -6.55
      objectReference: {fileID: 0}
    - target: {fileID: 450930, guid: 5d24c8b5c9abd754d877d25ebd733bdf, type: 3}
      propertyPath: m_LocalRotation.w
      value: 1
      objectReference: {fileID: 0}
    - target: {fileID: 450930, guid: 5d24c8b5c9abd754d877d25ebd733bdf, type: 3}
      propertyPath: m_LocalRotation.x
      value: 0
      objectReference: {fileID: 0}
    - target: {fileID: 450930, guid: 5d24c8b5c9abd754d877d25ebd733bdf, type: 3}
      propertyPath: m_LocalRotation.y
      value: 0
      objectReference: {fileID: 0}
    - target: {fileID: 450930, guid: 5d24c8b5c9abd754d877d25ebd733bdf, type: 3}
      propertyPath: m_LocalRotation.z
      value: 0
      objectReference: {fileID: 0}
    m_RemovedComponents: []
  m_SourcePrefab: {fileID: 100100000, guid: 5d24c8b5c9abd754d877d25ebd733bdf, type: 3}
--- !u!4 &1596347856 stripped
Transform:
  m_CorrespondingSourceObject: {fileID: 450930, guid: 5d24c8b5c9abd754d877d25ebd733bdf, type: 3}
  m_PrefabInstance: {fileID: 1596347855}
  m_PrefabAsset: {fileID: 0}
--- !u!4 &1660050596 stripped
Transform:
  m_CorrespondingSourceObject: {fileID: 471988, guid: 79cd481c8e7a27a44ba9a78fbb16b903, type: 3}
  m_PrefabInstance: {fileID: 1364859960}
  m_PrefabAsset: {fileID: 0}
--- !u!4 &1857410381 stripped
Transform:
  m_CorrespondingSourceObject: {fileID: 486756, guid: e369416ca848b20439557e28d5afc76f, type: 3}
  m_PrefabInstance: {fileID: 46107307}
  m_PrefabAsset: {fileID: 0}
--- !u!1001 &1864604427
PrefabInstance:
  m_ObjectHideFlags: 0
  serializedVersion: 2
  m_Modification:
    m_TransformParent: {fileID: 2060794256}
    m_Modifications:
    - target: {fileID: 457352, guid: 087da436576d35542825d392925d79c4, type: 3}
      propertyPath: m_RootOrder
      value: 5
      objectReference: {fileID: 0}
    - target: {fileID: 457352, guid: 087da436576d35542825d392925d79c4, type: 3}
      propertyPath: m_LocalPosition.x
      value: 3.25
      objectReference: {fileID: 0}
    - target: {fileID: 457352, guid: 087da436576d35542825d392925d79c4, type: 3}
      propertyPath: m_LocalPosition.y
      value: 0.34
      objectReference: {fileID: 0}
    - target: {fileID: 457352, guid: 087da436576d35542825d392925d79c4, type: 3}
      propertyPath: m_LocalPosition.z
      value: 1.95
      objectReference: {fileID: 0}
    - target: {fileID: 457352, guid: 087da436576d35542825d392925d79c4, type: 3}
      propertyPath: m_LocalRotation.w
      value: 1
      objectReference: {fileID: 0}
    - target: {fileID: 457352, guid: 087da436576d35542825d392925d79c4, type: 3}
      propertyPath: m_LocalRotation.x
      value: 0
      objectReference: {fileID: 0}
    - target: {fileID: 457352, guid: 087da436576d35542825d392925d79c4, type: 3}
      propertyPath: m_LocalRotation.y
      value: 0
      objectReference: {fileID: 0}
    - target: {fileID: 457352, guid: 087da436576d35542825d392925d79c4, type: 3}
      propertyPath: m_LocalRotation.z
      value: 0
      objectReference: {fileID: 0}
    m_RemovedComponents: []
  m_SourcePrefab: {fileID: 100100000, guid: 087da436576d35542825d392925d79c4, type: 3}
--- !u!1001 &1899473989
PrefabInstance:
  m_ObjectHideFlags: 0
  serializedVersion: 2
  m_Modification:
    m_TransformParent: {fileID: 2060794256}
    m_Modifications:
    - target: {fileID: 406902, guid: 11943dcb81a97804fbd4b58ce063f22b, type: 3}
      propertyPath: m_RootOrder
      value: 2
      objectReference: {fileID: 0}
    - target: {fileID: 406902, guid: 11943dcb81a97804fbd4b58ce063f22b, type: 3}
      propertyPath: m_LocalScale.x
      value: 1
      objectReference: {fileID: 0}
    - target: {fileID: 406902, guid: 11943dcb81a97804fbd4b58ce063f22b, type: 3}
      propertyPath: m_LocalPosition.x
      value: 8
      objectReference: {fileID: 0}
    - target: {fileID: 406902, guid: 11943dcb81a97804fbd4b58ce063f22b, type: 3}
      propertyPath: m_LocalPosition.y
      value: 1.42
      objectReference: {fileID: 0}
    - target: {fileID: 406902, guid: 11943dcb81a97804fbd4b58ce063f22b, type: 3}
      propertyPath: m_LocalPosition.z
      value: -2.3
      objectReference: {fileID: 0}
    - target: {fileID: 406902, guid: 11943dcb81a97804fbd4b58ce063f22b, type: 3}
      propertyPath: m_LocalRotation.w
      value: 0.6830126
      objectReference: {fileID: 0}
    - target: {fileID: 406902, guid: 11943dcb81a97804fbd4b58ce063f22b, type: 3}
      propertyPath: m_LocalRotation.x
      value: -0.1830124
      objectReference: {fileID: 0}
    - target: {fileID: 406902, guid: 11943dcb81a97804fbd4b58ce063f22b, type: 3}
      propertyPath: m_LocalRotation.y
      value: -0.1830125
      objectReference: {fileID: 0}
    - target: {fileID: 406902, guid: 11943dcb81a97804fbd4b58ce063f22b, type: 3}
      propertyPath: m_LocalRotation.z
      value: 0.6830129
      objectReference: {fileID: 0}
    - target: {fileID: 406902, guid: 11943dcb81a97804fbd4b58ce063f22b, type: 3}
      propertyPath: m_LocalEulerAnglesHint.y
      value: -30
      objectReference: {fileID: 0}
    m_RemovedComponents: []
  m_SourcePrefab: {fileID: 100100000, guid: 11943dcb81a97804fbd4b58ce063f22b, type: 3}
--- !u!1001 &1997280392
PrefabInstance:
  m_ObjectHideFlags: 0
  serializedVersion: 2
  m_Modification:
    m_TransformParent: {fileID: 2060794256}
    m_Modifications:
    - target: {fileID: 444072, guid: 8ade55bc7f33dcc46947f3bc7d22bc3b, type: 3}
      propertyPath: m_RootOrder
      value: 13
      objectReference: {fileID: 0}
    - target: {fileID: 444072, guid: 8ade55bc7f33dcc46947f3bc7d22bc3b, type: 3}
      propertyPath: m_LocalScale.y
      value: 1
      objectReference: {fileID: 0}
    - target: {fileID: 444072, guid: 8ade55bc7f33dcc46947f3bc7d22bc3b, type: 3}
      propertyPath: m_LocalScale.z
      value: 1
      objectReference: {fileID: 0}
    - target: {fileID: 444072, guid: 8ade55bc7f33dcc46947f3bc7d22bc3b, type: 3}
      propertyPath: m_LocalPosition.x
      value: -7.87
      objectReference: {fileID: 0}
    - target: {fileID: 444072, guid: 8ade55bc7f33dcc46947f3bc7d22bc3b, type: 3}
      propertyPath: m_LocalPosition.y
      value: 1.54
      objectReference: {fileID: 0}
    - target: {fileID: 444072, guid: 8ade55bc7f33dcc46947f3bc7d22bc3b, type: 3}
      propertyPath: m_LocalPosition.z
      value: -2.4
      objectReference: {fileID: 0}
    - target: {fileID: 444072, guid: 8ade55bc7f33dcc46947f3bc7d22bc3b, type: 3}
      propertyPath: m_LocalRotation.w
      value: 0
      objectReference: {fileID: 0}
    - target: {fileID: 444072, guid: 8ade55bc7f33dcc46947f3bc7d22bc3b, type: 3}
      propertyPath: m_LocalRotation.x
      value: -1
      objectReference: {fileID: 0}
    - target: {fileID: 444072, guid: 8ade55bc7f33dcc46947f3bc7d22bc3b, type: 3}
      propertyPath: m_LocalRotation.y
      value: 0
      objectReference: {fileID: 0}
    - target: {fileID: 444072, guid: 8ade55bc7f33dcc46947f3bc7d22bc3b, type: 3}
      propertyPath: m_LocalRotation.z
      value: 0
      objectReference: {fileID: 0}
    - target: {fileID: 444072, guid: 8ade55bc7f33dcc46947f3bc7d22bc3b, type: 3}
      propertyPath: m_LocalEulerAnglesHint.x
      value: 0
      objectReference: {fileID: 0}
    - target: {fileID: 444072, guid: 8ade55bc7f33dcc46947f3bc7d22bc3b, type: 3}
      propertyPath: m_LocalEulerAnglesHint.y
      value: -180
      objectReference: {fileID: 0}
    - target: {fileID: 444072, guid: 8ade55bc7f33dcc46947f3bc7d22bc3b, type: 3}
      propertyPath: m_LocalEulerAnglesHint.z
      value: -180
      objectReference: {fileID: 0}
    m_RemovedComponents: []
  m_SourcePrefab: {fileID: 100100000, guid: 8ade55bc7f33dcc46947f3bc7d22bc3b, type: 3}
--- !u!4 &1997280393 stripped
Transform:
  m_CorrespondingSourceObject: {fileID: 444072, guid: 8ade55bc7f33dcc46947f3bc7d22bc3b, type: 3}
  m_PrefabInstance: {fileID: 1997280392}
  m_PrefabAsset: {fileID: 0}
--- !u!4 &2017811202 stripped
Transform:
  m_CorrespondingSourceObject: {fileID: 457352, guid: 087da436576d35542825d392925d79c4, type: 3}
  m_PrefabInstance: {fileID: 1864604427}
  m_PrefabAsset: {fileID: 0}
--- !u!1 &2031238729
GameObject:
  m_ObjectHideFlags: 0
  m_CorrespondingSourceObject: {fileID: 0}
  m_PrefabInstance: {fileID: 0}
  m_PrefabAsset: {fileID: 0}
  serializedVersion: 6
  m_Component:
  - component: {fileID: 2031238731}
  - component: {fileID: 2031238730}
  m_Layer: 0
  m_Name: Directional Light
  m_TagString: Untagged
  m_Icon: {fileID: 0}
  m_NavMeshLayer: 0
  m_StaticEditorFlags: 4294967295
  m_IsActive: 1
--- !u!108 &2031238730
Light:
  m_ObjectHideFlags: 0
  m_CorrespondingSourceObject: {fileID: 0}
  m_PrefabInstance: {fileID: 0}
  m_PrefabAsset: {fileID: 0}
  m_GameObject: {fileID: 2031238729}
  m_Enabled: 1
  serializedVersion: 10
  m_Type: 1
  m_Shape: 0
  m_Color: {r: 1, g: 0.95686275, b: 0.8392157, a: 1}
  m_Intensity: 0.2
  m_Range: 10
  m_SpotAngle: 30
  m_InnerSpotAngle: 21.80208
  m_CookieSize: 10
  m_Shadows:
    m_Type: 2
    m_Resolution: -1
    m_CustomResolution: -1
    m_Strength: 1
    m_Bias: 0.05
    m_NormalBias: 0.4
    m_NearPlane: 0.2
    m_CullingMatrixOverride:
      e00: 1
      e01: 0
      e02: 0
      e03: 0
      e10: 0
      e11: 1
      e12: 0
      e13: 0
      e20: 0
      e21: 0
      e22: 1
      e23: 0
      e30: 0
      e31: 0
      e32: 0
      e33: 1
    m_UseCullingMatrixOverride: 0
  m_Cookie: {fileID: 0}
  m_DrawHalo: 0
  m_Flare: {fileID: 0}
  m_RenderMode: 0
  m_CullingMask:
    serializedVersion: 2
    m_Bits: 4294967295
  m_RenderingLayerMask: 1
  m_Lightmapping: 2
  m_LightShadowCasterMode: 0
  m_AreaSize: {x: 1, y: 1}
  m_BounceIntensity: 1
  m_ColorTemperature: 6570
  m_UseColorTemperature: 0
  m_BoundingSphereOverride: {x: 0, y: 0, z: 0, w: 0}
  m_UseBoundingSphereOverride: 0
  m_UseViewFrustumForShadowCasterCull: 1
  m_ShadowRadius: 0
  m_ShadowAngle: 0
--- !u!4 &2031238731
Transform:
  m_ObjectHideFlags: 0
  m_CorrespondingSourceObject: {fileID: 0}
  m_PrefabInstance: {fileID: 0}
  m_PrefabAsset: {fileID: 0}
  m_GameObject: {fileID: 2031238729}
  m_LocalRotation: {x: 0.40821794, y: -0.23456973, z: 0.109381676, w: 0.87542605}
  m_LocalPosition: {x: -2.54, y: 8.98, z: 4.4}
  m_LocalScale: {x: 1, y: 1, z: 1}
  m_Children: []
  m_Father: {fileID: 0}
  m_RootOrder: 0
  m_LocalEulerAnglesHint: {x: 50, y: -30, z: 0}
--- !u!1 &2060794255
GameObject:
  m_ObjectHideFlags: 0
  m_CorrespondingSourceObject: {fileID: 0}
  m_PrefabInstance: {fileID: 0}
  m_PrefabAsset: {fileID: 0}
  serializedVersion: 6
  m_Component:
  - component: {fileID: 2060794256}
  m_Layer: 0
  m_Name: Effects
  m_TagString: Untagged
  m_Icon: {fileID: 0}
  m_NavMeshLayer: 0
  m_StaticEditorFlags: 0
  m_IsActive: 1
--- !u!4 &2060794256
Transform:
  m_ObjectHideFlags: 0
  m_CorrespondingSourceObject: {fileID: 0}
  m_PrefabInstance: {fileID: 0}
  m_PrefabAsset: {fileID: 0}
  m_GameObject: {fileID: 2060794255}
  m_LocalRotation: {x: 0, y: 0, z: 0, w: 1}
  m_LocalPosition: {x: 0, y: 0, z: 0}
  m_LocalScale: {x: 1, y: 1, z: 1}
  m_Children:
  - {fileID: 2111601830}
  - {fileID: 1857410381}
  - {fileID: 811385979}
  - {fileID: 360592085}
  - {fileID: 958992867}
  - {fileID: 2017811202}
  - {fileID: 312586429}
  - {fileID: 1660050596}
  - {fileID: 700823225}
  - {fileID: 945764671}
  - {fileID: 111992729}
  - {fileID: 1596347856}
  - {fileID: 2139821111}
  - {fileID: 1997280393}
  - {fileID: 387374620}
  - {fileID: 310046066}
  m_Father: {fileID: 0}
  m_RootOrder: 3
  m_LocalEulerAnglesHint: {x: 0, y: 0, z: 0}
--- !u!4 &2111601830 stripped
Transform:
  m_CorrespondingSourceObject: {fileID: 481270, guid: c26b84f8b12b03f4d8f03ce1826c0278, type: 3}
  m_PrefabInstance: {fileID: 240096623}
  m_PrefabAsset: {fileID: 0}
--- !u!1001 &2139821110
PrefabInstance:
  m_ObjectHideFlags: 0
  serializedVersion: 2
  m_Modification:
    m_TransformParent: {fileID: 2060794256}
    m_Modifications:
    - target: {fileID: 463064, guid: 24c9c019834754547bed7a5da7659696, type: 3}
      propertyPath: m_RootOrder
      value: 12
      objectReference: {fileID: 0}
    - target: {fileID: 463064, guid: 24c9c019834754547bed7a5da7659696, type: 3}
      propertyPath: m_LocalScale.y
      value: 1
      objectReference: {fileID: 0}
    - target: {fileID: 463064, guid: 24c9c019834754547bed7a5da7659696, type: 3}
      propertyPath: m_LocalScale.z
      value: 1
      objectReference: {fileID: 0}
    - target: {fileID: 463064, guid: 24c9c019834754547bed7a5da7659696, type: 3}
      propertyPath: m_LocalPosition.x
      value: -7.84
      objectReference: {fileID: 0}
    - target: {fileID: 463064, guid: 24c9c019834754547bed7a5da7659696, type: 3}
      propertyPath: m_LocalPosition.y
      value: 1.54
      objectReference: {fileID: 0}
    - target: {fileID: 463064, guid: 24c9c019834754547bed7a5da7659696, type: 3}
      propertyPath: m_LocalPosition.z
      value: 1.97
      objectReference: {fileID: 0}
    - target: {fileID: 463064, guid: 24c9c019834754547bed7a5da7659696, type: 3}
      propertyPath: m_LocalRotation.w
      value: 0
      objectReference: {fileID: 0}
    - target: {fileID: 463064, guid: 24c9c019834754547bed7a5da7659696, type: 3}
      propertyPath: m_LocalRotation.x
      value: -1
      objectReference: {fileID: 0}
    - target: {fileID: 463064, guid: 24c9c019834754547bed7a5da7659696, type: 3}
      propertyPath: m_LocalRotation.y
      value: 0
      objectReference: {fileID: 0}
    - target: {fileID: 463064, guid: 24c9c019834754547bed7a5da7659696, type: 3}
      propertyPath: m_LocalRotation.z
      value: 0
      objectReference: {fileID: 0}
    - target: {fileID: 463064, guid: 24c9c019834754547bed7a5da7659696, type: 3}
      propertyPath: m_LocalEulerAnglesHint.x
      value: 0
      objectReference: {fileID: 0}
    - target: {fileID: 463064, guid: 24c9c019834754547bed7a5da7659696, type: 3}
      propertyPath: m_LocalEulerAnglesHint.y
      value: -180
      objectReference: {fileID: 0}
    - target: {fileID: 463064, guid: 24c9c019834754547bed7a5da7659696, type: 3}
      propertyPath: m_LocalEulerAnglesHint.z
      value: -180
      objectReference: {fileID: 0}
    m_RemovedComponents: []
  m_SourcePrefab: {fileID: 100100000, guid: 24c9c019834754547bed7a5da7659696, type: 3}
--- !u!4 &2139821111 stripped
Transform:
  m_CorrespondingSourceObject: {fileID: 463064, guid: 24c9c019834754547bed7a5da7659696, type: 3}
  m_PrefabInstance: {fileID: 2139821110}
  m_PrefabAsset: {fileID: 0}
