%YAML 1.1
%TAG !u! tag:unity3d.com,2011:
--- !u!114 &11400000
MonoBehaviour:
  m_ObjectHideFlags: 0
  m_CorrespondingSourceObject: {fileID: 0}
  m_PrefabInstance: {fileID: 0}
  m_PrefabAsset: {fileID: 0}
  m_GameObject: {fileID: 0}
  m_Enabled: 1
  m_EditorHideFlags: 0
  m_Script: {fileID: 11500000, guid: fb9f7ff4ef764b338089cac5f322092b, type: 3}
  m_Name: SimpleItem 4
  m_EditorClassIdentifier: 
  iconSprite: {fileID: 21300000, guid: 2872753fd16559546af5bebcbda0ec20, type: 3}
  defaultPercent: 86
  itemName: wrbwr
  description: ewb gewrbgweg gegewg
  color: {r: 0, g: 1, b: 0.5091231, a: 1}
