%YAML 1.1
%TAG !u! tag:unity3d.com,2011:
--- !u!114 &11400000
MonoBehaviour:
  m_ObjectHideFlags: 0
  m_CorrespondingSourceObject: {fileID: 0}
  m_PrefabInstance: {fileID: 0}
  m_PrefabAsset: {fileID: 0}
  m_GameObject: {fileID: 0}
  m_Enabled: 1
  m_EditorHideFlags: 0
  m_Script: {fileID: 11500000, guid: fb9f7ff4ef764b338089cac5f322092b, type: 3}
  m_Name: SimpleItem
  m_EditorClassIdentifier: 
  iconSprite: {fileID: 21300000, guid: 6de49d247feda494bb91b17414e3d0b5, type: 3}
  defaultPercent: 23
  itemName: Evolution
  description: Explore themself and create own life
  color: {r: 1, g: 0, b: 0, a: 1}
