%YAML 1.1
%TAG !u! tag:unity3d.com,2011:
--- !u!74 &7400000
AnimationClip:
  m_ObjectHideFlags: 0
  m_CorrespondingSourceObject: {fileID: 0}
  m_PrefabInstance: {fileID: 0}
  m_PrefabAsset: {fileID: 0}
  m_Name: IdlePlayer2
  serializedVersion: 6
  m_Legacy: 0
  m_Compressed: 0
  m_UseHighQualityCurve: 1
  m_RotationCurves: []
  m_CompressedRotationCurves: []
  m_EulerCurves: []
  m_PositionCurves: []
  m_ScaleCurves: []
  m_FloatCurves: []
  m_PPtrCurves:
  - curve:
    - time: 0
      value: {fileID: 21300000, guid: 5e2552ac78f168c4fa7ec2e7c448b056, type: 3}
    - time: 0.033333335
      value: {fileID: 21300000, guid: 0c75d13844881564cb6ad54bd575c86b, type: 3}
    - time: 0.083333336
      value: {fileID: 21300000, guid: 4d8642338394195479cda544010bb983, type: 3}
    - time: 0.11666667
      value: {fileID: 21300000, guid: 75088af26321f8c47bf3548a3d304214, type: 3}
    - time: 0.15
      value: {fileID: 21300000, guid: 9c7b43c893146e24aab264fa43b27f6e, type: 3}
    - time: 0.18333334
      value: {fileID: 21300000, guid: bf8fd117e30abab4b8d494fbebb6a2b0, type: 3}
    - time: 0.23333333
      value: {fileID: 21300000, guid: b1e1c18e04bc01948814efb0819735d4, type: 3}
    - time: 0.26666668
      value: {fileID: 21300000, guid: 9eb45959a8ef80240a42fbc5dc9ef806, type: 3}
    - time: 0.3
      value: {fileID: 21300000, guid: 5930d14707b79934f84b4b521075ee63, type: 3}
    - time: 0.33333334
      value: {fileID: 21300000, guid: d3ea6acf19c986f4b9b97381ef3d8ac2, type: 3}
    - time: 0.38333333
      value: {fileID: 21300000, guid: 8a035526dede53c4ba6f30fb22e59c6a, type: 3}
    - time: 0.41666666
      value: {fileID: 21300000, guid: 6bc38221b3a0c6e4088bbc3eaf3c1c04, type: 3}
    - time: 0.45
      value: {fileID: 21300000, guid: dbdd93c5f734ef443b850665db83b97f, type: 3}
    - time: 0.48333332
      value: {fileID: 21300000, guid: f8d867f68dbbc794b8e19ac3c35f49be, type: 3}
    - time: 0.53333336
      value: {fileID: 21300000, guid: 7dd0634c5dd6e3441ba6347427331a05, type: 3}
    - time: 0.56666666
      value: {fileID: 21300000, guid: 01d88cf3e17fd00499ff6a9a4351b97b, type: 3}
    attribute: m_Sprite
    path: 
    classID: 212
    script: {fileID: 0}
  m_SampleRate: 60
  m_WrapMode: 0
  m_Bounds:
    m_Center: {x: 0, y: 0, z: 0}
    m_Extent: {x: 0, y: 0, z: 0}
  m_ClipBindingConstant:
    genericBindings:
    - serializedVersion: 2
      path: 0
      attribute: 0
      script: {fileID: 0}
      typeID: 212
      customType: 23
      isPPtrCurve: 1
    pptrCurveMapping:
    - {fileID: 21300000, guid: 5e2552ac78f168c4fa7ec2e7c448b056, type: 3}
    - {fileID: 21300000, guid: 0c75d13844881564cb6ad54bd575c86b, type: 3}
    - {fileID: 21300000, guid: 4d8642338394195479cda544010bb983, type: 3}
    - {fileID: 21300000, guid: 75088af26321f8c47bf3548a3d304214, type: 3}
    - {fileID: 21300000, guid: 9c7b43c893146e24aab264fa43b27f6e, type: 3}
    - {fileID: 21300000, guid: bf8fd117e30abab4b8d494fbebb6a2b0, type: 3}
    - {fileID: 21300000, guid: b1e1c18e04bc01948814efb0819735d4, type: 3}
    - {fileID: 21300000, guid: 9eb45959a8ef80240a42fbc5dc9ef806, type: 3}
    - {fileID: 21300000, guid: 5930d14707b79934f84b4b521075ee63, type: 3}
    - {fileID: 21300000, guid: d3ea6acf19c986f4b9b97381ef3d8ac2, type: 3}
    - {fileID: 21300000, guid: 8a035526dede53c4ba6f30fb22e59c6a, type: 3}
    - {fileID: 21300000, guid: 6bc38221b3a0c6e4088bbc3eaf3c1c04, type: 3}
    - {fileID: 21300000, guid: dbdd93c5f734ef443b850665db83b97f, type: 3}
    - {fileID: 21300000, guid: f8d867f68dbbc794b8e19ac3c35f49be, type: 3}
    - {fileID: 21300000, guid: 7dd0634c5dd6e3441ba6347427331a05, type: 3}
    - {fileID: 21300000, guid: 01d88cf3e17fd00499ff6a9a4351b97b, type: 3}
  m_AnimationClipSettings:
    serializedVersion: 2
    m_AdditiveReferencePoseClip: {fileID: 0}
    m_AdditiveReferencePoseTime: 0
    m_StartTime: 0
    m_StopTime: 0.5833333
    m_OrientationOffsetY: 0
    m_Level: 0
    m_CycleOffset: 0
    m_HasAdditiveReferencePose: 0
    m_LoopTime: 1
    m_LoopBlend: 0
    m_LoopBlendOrientation: 0
    m_LoopBlendPositionY: 0
    m_LoopBlendPositionXZ: 0
    m_KeepOriginalOrientation: 0
    m_KeepOriginalPositionY: 1
    m_KeepOriginalPositionXZ: 0
    m_HeightFromFeet: 0
    m_Mirror: 0
  m_EditorCurves: []
  m_EulerEditorCurves: []
  m_HasGenericRootTransform: 0
  m_HasMotionFloatCurves: 0
  m_Events: []
