%YAML 1.1
%TAG !u! tag:unity3d.com,2011:
--- !u!74 &7400000
AnimationClip:
  m_ObjectHideFlags: 0
  m_CorrespondingSourceObject: {fileID: 0}
  m_PrefabInstance: {fileID: 0}
  m_PrefabAsset: {fileID: 0}
  m_Name: RunPl2
  serializedVersion: 6
  m_Legacy: 0
  m_Compressed: 0
  m_UseHighQualityCurve: 1
  m_RotationCurves: []
  m_CompressedRotationCurves: []
  m_EulerCurves: []
  m_PositionCurves: []
  m_ScaleCurves: []
  m_FloatCurves: []
  m_PPtrCurves:
  - curve:
    - time: 0
      value: {fileID: 21300000, guid: 8d25a138ec8df0343a0c4a76e43f0ad0, type: 3}
    - time: 0.033333335
      value: {fileID: 21300000, guid: bff750a6524df994db0ddd3ec15987a8, type: 3}
    - time: 0.083333336
      value: {fileID: 21300000, guid: 2bbbdc6153ffc364789a42dc003db70f, type: 3}
    - time: 0.13333334
      value: {fileID: 21300000, guid: 9b5d0bd98f7605142b2c96120e9481c1, type: 3}
    - time: 0.18333334
      value: {fileID: 21300000, guid: f47b0a3710b544f49b43f86987978200, type: 3}
    - time: 0.21666667
      value: {fileID: 21300000, guid: 6cafc1102c612ee43b1b59bcfe1a7a83, type: 3}
    - time: 0.26666668
      value: {fileID: 21300000, guid: c3b8de10e1fc2ec4083a44e7f1965ed5, type: 3}
    - time: 0.3
      value: {fileID: 21300000, guid: 9bb42a7d72a408d44965cb868691095a, type: 3}
    - time: 0.36666667
      value: {fileID: 21300000, guid: d66d70364a2e41949b307c94d80ad917, type: 3}
    - time: 0.4
      value: {fileID: 21300000, guid: f1d07ed410ac1eb4a90eff855d642b65, type: 3}
    - time: 0.45
      value: {fileID: 21300000, guid: e229638ba760c344891843d6095f49af, type: 3}
    - time: 0.48333332
      value: {fileID: 21300000, guid: 5c1d157f25b06864a96068745f974a66, type: 3}
    - time: 0.53333336
      value: {fileID: 21300000, guid: 7d995e85bc3b02b4086f98f3f1808e3f, type: 3}
    - time: 0.5833333
      value: {fileID: 21300000, guid: eacb7a198110022498728eacb432a589, type: 3}
    - time: 0.6333333
      value: {fileID: 21300000, guid: 085fd80c6dbc005499fb15cfa00fefa9, type: 3}
    - time: 0.6666667
      value: {fileID: 21300000, guid: 4215fb7d527120d4b83d0548b4d04cfb, type: 3}
    attribute: m_Sprite
    path: 
    classID: 212
    script: {fileID: 0}
  m_SampleRate: 60
  m_WrapMode: 0
  m_Bounds:
    m_Center: {x: 0, y: 0, z: 0}
    m_Extent: {x: 0, y: 0, z: 0}
  m_ClipBindingConstant:
    genericBindings:
    - serializedVersion: 2
      path: 0
      attribute: 0
      script: {fileID: 0}
      typeID: 212
      customType: 23
      isPPtrCurve: 1
    pptrCurveMapping:
    - {fileID: 21300000, guid: 8d25a138ec8df0343a0c4a76e43f0ad0, type: 3}
    - {fileID: 21300000, guid: bff750a6524df994db0ddd3ec15987a8, type: 3}
    - {fileID: 21300000, guid: 2bbbdc6153ffc364789a42dc003db70f, type: 3}
    - {fileID: 21300000, guid: 9b5d0bd98f7605142b2c96120e9481c1, type: 3}
    - {fileID: 21300000, guid: f47b0a3710b544f49b43f86987978200, type: 3}
    - {fileID: 21300000, guid: 6cafc1102c612ee43b1b59bcfe1a7a83, type: 3}
    - {fileID: 21300000, guid: c3b8de10e1fc2ec4083a44e7f1965ed5, type: 3}
    - {fileID: 21300000, guid: 9bb42a7d72a408d44965cb868691095a, type: 3}
    - {fileID: 21300000, guid: d66d70364a2e41949b307c94d80ad917, type: 3}
    - {fileID: 21300000, guid: f1d07ed410ac1eb4a90eff855d642b65, type: 3}
    - {fileID: 21300000, guid: e229638ba760c344891843d6095f49af, type: 3}
    - {fileID: 21300000, guid: 5c1d157f25b06864a96068745f974a66, type: 3}
    - {fileID: 21300000, guid: 7d995e85bc3b02b4086f98f3f1808e3f, type: 3}
    - {fileID: 21300000, guid: eacb7a198110022498728eacb432a589, type: 3}
    - {fileID: 21300000, guid: 085fd80c6dbc005499fb15cfa00fefa9, type: 3}
    - {fileID: 21300000, guid: 4215fb7d527120d4b83d0548b4d04cfb, type: 3}
  m_AnimationClipSettings:
    serializedVersion: 2
    m_AdditiveReferencePoseClip: {fileID: 0}
    m_AdditiveReferencePoseTime: 0
    m_StartTime: 0
    m_StopTime: 0.68333334
    m_OrientationOffsetY: 0
    m_Level: 0
    m_CycleOffset: 0
    m_HasAdditiveReferencePose: 0
    m_LoopTime: 1
    m_LoopBlend: 0
    m_LoopBlendOrientation: 0
    m_LoopBlendPositionY: 0
    m_LoopBlendPositionXZ: 0
    m_KeepOriginalOrientation: 0
    m_KeepOriginalPositionY: 1
    m_KeepOriginalPositionXZ: 0
    m_HeightFromFeet: 0
    m_Mirror: 0
  m_EditorCurves: []
  m_EulerEditorCurves: []
  m_HasGenericRootTransform: 0
  m_HasMotionFloatCurves: 0
  m_Events: []
