%YAML 1.1
%TAG !u! tag:unity3d.com,2011:
--- !u!114 &11400000
MonoBehaviour:
  m_ObjectHideFlags: 0
  m_CorrespondingSourceObject: {fileID: 0}
  m_PrefabInstance: {fileID: 0}
  m_PrefabAsset: {fileID: 0}
  m_GameObject: {fileID: 0}
  m_Enabled: 1
  m_EditorHideFlags: 0
  m_Script: {fileID: 11500000, guid: 4d1e854db0a74197a28780febbc8999a, type: 3}
  m_Name: GreenMagicPotion
  m_EditorClassIdentifier: 
  itemName: Green Magic Potion
  itemDescription: I don't wont to drink it. Drink up?
  itemSprite: {fileID: 21300000, guid: 26d0fa7e07853554082b7481249a42fd, type: 3}
  numberHeld: 0
  usable: 1
  unique: 0
  thisEvent:
    m_PersistentCalls:
      m_Calls:
      - m_Target: {fileID: 1662183924595915255, guid: e6182ef39fb6c154c93380afe4fa323a, type: 3}
        m_TargetAssemblyTypeName: Mehanics.InventoryItemReactions.MagicReaction,
          Assembly-CSharp
        m_MethodName: SetMagicReaction
        m_Mode: 3
        m_Arguments:
          m_ObjectArgument: {fileID: 0}
          m_ObjectArgumentAssemblyTypeName: UnityEngine.Object, UnityEngine
          m_IntArgument: 10
          m_FloatArgument: 0
          m_StringArgument: 
          m_BoolArgument: 0
        m_CallState: 2
