%YAML 1.1
%TAG !u! tag:unity3d.com,2011:
--- !u!114 &11400000
MonoBehaviour:
  m_ObjectHideFlags: 0
  m_CorrespondingSourceObject: {fileID: 0}
  m_PrefabInstance: {fileID: 0}
  m_PrefabAsset: {fileID: 0}
  m_GameObject: {fileID: 0}
  m_Enabled: 1
  m_EditorHideFlags: 0
  m_Script: {fileID: 11500000, guid: 4d1e854db0a74197a28780febbc8999a, type: 3}
  m_Name: RedHealthPotion
  m_EditorClassIdentifier: 
  itemName: Red Health Potion
  itemDescription: Ou, it smells like your socks. Drink up?
  itemSprite: {fileID: 21300000, guid: a361cb05f60e55a4caf553b774b9a940, type: 3}
  numberHeld: 0
  usable: 1
  unique: 0
  thisEvent:
    m_PersistentCalls:
      m_Calls:
      - m_Target: {fileID: 6680847780592419304, guid: 4d0e4ca971a8f0f40ac09b30d7f42691, type: 3}
        m_TargetAssemblyTypeName: Mehanics.InventoryItemReactions.HealthReaction,
          Assembly-CSharp
        m_MethodName: SetHealthReaction
        m_Mode: 3
        m_Arguments:
          m_ObjectArgument: {fileID: 0}
          m_ObjectArgumentAssemblyTypeName: UnityEngine.Object, UnityEngine
          m_IntArgument: 4
          m_FloatArgument: 0
          m_StringArgument: 
          m_BoolArgument: 0
        m_CallState: 2
      - m_Target: {fileID: 11400000}
        m_TargetAssemblyTypeName: ScriptableObjects.InventoryItem, Assembly-CSharp
        m_MethodName: DecreaseAmount
        m_Mode: 3
        m_Arguments:
          m_ObjectArgument: {fileID: 0}
          m_ObjectArgumentAssemblyTypeName: UnityEngine.Object, UnityEngine
          m_IntArgument: 1
          m_FloatArgument: 0
          m_StringArgument: 
          m_BoolArgument: 0
        m_CallState: 2
