%YAML 1.1
%TAG !u! tag:unity3d.com,2011:
--- !u!1045 &1
EditorBuildSettings:
  m_ObjectHideFlags: 0
  serializedVersion: 2
  m_Scenes:
  - enabled: 1
    path: Assets/_Project/Scenes/Game.unity
    guid: aa299ccc373cacb4bab30a49f88137c7
  - enabled: 1
    path: Assets/_Project/Scenes/Complete.unity
    guid: 6ded0651f5136804898ab30b57fb300b
  m_configObjects: {}
