%YAML 1.1
%TAG !u! tag:unity3d.com,2011:
--- !u!114 &11400000
MonoBehaviour:
  m_ObjectHideFlags: 0
  m_CorrespondingSourceObject: {fileID: 0}
  m_PrefabInstance: {fileID: 0}
  m_PrefabAsset: {fileID: 0}
  m_GameObject: {fileID: 0}
  m_Enabled: 1
  m_EditorHideFlags: 0
  m_Script: {fileID: 11500000, guid: 84a92b25f83d49b9bc132d206b370281, type: 3}
  m_Name: ResourcesTMP
  m_EditorClassIdentifier: 
  hashCode: -509630416
  material: {fileID: 4820620802353119283}
  materialHashCode: 0
  m_Version: 1.1.0
  m_FaceInfo:
    m_FaceIndex: 0
    m_FamilyName: 
    m_StyleName: 
    m_PointSize: 0
    m_Scale: 0
    m_LineHeight: 0
    m_AscentLine: 0
    m_CapLine: 0
    m_MeanLine: 0
    m_Baseline: 0
    m_DescentLine: 0
    m_SuperscriptOffset: 0
    m_SuperscriptSize: 0
    m_SubscriptOffset: 0
    m_SubscriptSize: 0
    m_UnderlineOffset: 0
    m_UnderlineThickness: 0
    m_StrikethroughOffset: 0
    m_StrikethroughThickness: 0
    m_TabWidth: 0
  spriteSheet: {fileID: 2800000, guid: 3f049e5f25da27849a059fbbb0e98b45, type: 3}
  m_SpriteCharacterTable:
  - m_ElementType: 2
    m_Unicode: 65534
    m_GlyphIndex: 0
    m_Scale: 1
    m_Name: 1f60a
    m_HashCode: 57188336
  - m_ElementType: 2
    m_Unicode: 65534
    m_GlyphIndex: 1
    m_Scale: 1
    m_Name: 1f60b
    m_HashCode: 57188339
  - m_ElementType: 2
    m_Unicode: 65534
    m_GlyphIndex: 2
    m_Scale: 1
    m_Name: 1f60d
    m_HashCode: 57188341
  - m_ElementType: 2
    m_Unicode: 65534
    m_GlyphIndex: 3
    m_Scale: 1
    m_Name: 1f60e
    m_HashCode: 57188340
  - m_ElementType: 2
    m_Unicode: 65534
    m_GlyphIndex: 4
    m_Scale: 1
    m_Name: 1f600
    m_HashCode: 57188257
  - m_ElementType: 2
    m_Unicode: 65534
    m_GlyphIndex: 5
    m_Scale: 1
    m_Name: 1f601
    m_HashCode: 57188256
  - m_ElementType: 2
    m_Unicode: 65534
    m_GlyphIndex: 6
    m_Scale: 1
    m_Name: 1f602
    m_HashCode: 57188259
  - m_ElementType: 2
    m_Unicode: 65534
    m_GlyphIndex: 7
    m_Scale: 1
    m_Name: 1f603
    m_HashCode: 57188258
  - m_ElementType: 2
    m_Unicode: 65534
    m_GlyphIndex: 8
    m_Scale: 1
    m_Name: 1f604
    m_HashCode: 57188261
  - m_ElementType: 2
    m_Unicode: 65534
    m_GlyphIndex: 9
    m_Scale: 1
    m_Name: 1f605
    m_HashCode: 57188260
  - m_ElementType: 2
    m_Unicode: 65534
    m_GlyphIndex: 10
    m_Scale: 1
    m_Name: 1f606
    m_HashCode: 57188263
  - m_ElementType: 2
    m_Unicode: 65534
    m_GlyphIndex: 11
    m_Scale: 1
    m_Name: 1f609
    m_HashCode: 57188264
  - m_ElementType: 2
    m_Unicode: 65534
    m_GlyphIndex: 12
    m_Scale: 1
    m_Name: 1f618
    m_HashCode: 57188168
  - m_ElementType: 2
    m_Unicode: 65534
    m_GlyphIndex: 13
    m_Scale: 1
    m_Name: 1f923
    m_HashCode: 57200239
  - m_ElementType: 2
    m_Unicode: 65534
    m_GlyphIndex: 14
    m_Scale: 1
    m_Name: 263a
    m_HashCode: 1748406
  - m_ElementType: 2
    m_Unicode: 65534
    m_GlyphIndex: 15
    m_Scale: 1
    m_Name: 2639
    m_HashCode: 1748462
  m_SpriteGlyphTable:
  - m_Index: 0
    m_Metrics:
      m_Width: 128
      m_Height: 128
      m_HorizontalBearingX: -0
      m_HorizontalBearingY: 115.2
      m_HorizontalAdvance: 128
    m_GlyphRect:
      m_X: 0
      m_Y: 384
      m_Width: 128
      m_Height: 128
    m_Scale: 1
    m_AtlasIndex: 0
    sprite: {fileID: 0}
  - m_Index: 1
    m_Metrics:
      m_Width: 128
      m_Height: 128
      m_HorizontalBearingX: -0
      m_HorizontalBearingY: 115.2
      m_HorizontalAdvance: 128
    m_GlyphRect:
      m_X: 128
      m_Y: 384
      m_Width: 128
      m_Height: 128
    m_Scale: 1
    m_AtlasIndex: 0
    sprite: {fileID: 0}
  - m_Index: 2
    m_Metrics:
      m_Width: 128
      m_Height: 128
      m_HorizontalBearingX: -0
      m_HorizontalBearingY: 115.2
      m_HorizontalAdvance: 128
    m_GlyphRect:
      m_X: 256
      m_Y: 384
      m_Width: 128
      m_Height: 128
    m_Scale: 1
    m_AtlasIndex: 0
    sprite: {fileID: 0}
  - m_Index: 3
    m_Metrics:
      m_Width: 128
      m_Height: 128
      m_HorizontalBearingX: -0
      m_HorizontalBearingY: 115.2
      m_HorizontalAdvance: 128
    m_GlyphRect:
      m_X: 384
      m_Y: 384
      m_Width: 128
      m_Height: 128
    m_Scale: 1
    m_AtlasIndex: 0
    sprite: {fileID: 0}
  - m_Index: 4
    m_Metrics:
      m_Width: 128
      m_Height: 128
      m_HorizontalBearingX: -0
      m_HorizontalBearingY: 115.2
      m_HorizontalAdvance: 128
    m_GlyphRect:
      m_X: 0
      m_Y: 256
      m_Width: 128
      m_Height: 128
    m_Scale: 1
    m_AtlasIndex: 0
    sprite: {fileID: 0}
  - m_Index: 5
    m_Metrics:
      m_Width: 128
      m_Height: 128
      m_HorizontalBearingX: -0
      m_HorizontalBearingY: 115.2
      m_HorizontalAdvance: 128
    m_GlyphRect:
      m_X: 128
      m_Y: 256
      m_Width: 128
      m_Height: 128
    m_Scale: 1
    m_AtlasIndex: 0
    sprite: {fileID: 0}
  - m_Index: 6
    m_Metrics:
      m_Width: 128
      m_Height: 128
      m_HorizontalBearingX: -0
      m_HorizontalBearingY: 115.2
      m_HorizontalAdvance: 128
    m_GlyphRect:
      m_X: 256
      m_Y: 256
      m_Width: 128
      m_Height: 128
    m_Scale: 1
    m_AtlasIndex: 0
    sprite: {fileID: 0}
  - m_Index: 7
    m_Metrics:
      m_Width: 128
      m_Height: 128
      m_HorizontalBearingX: -0
      m_HorizontalBearingY: 115.2
      m_HorizontalAdvance: 128
    m_GlyphRect:
      m_X: 384
      m_Y: 256
      m_Width: 128
      m_Height: 128
    m_Scale: 1
    m_AtlasIndex: 0
    sprite: {fileID: 0}
  - m_Index: 8
    m_Metrics:
      m_Width: 128
      m_Height: 128
      m_HorizontalBearingX: -0
      m_HorizontalBearingY: 115.2
      m_HorizontalAdvance: 128
    m_GlyphRect:
      m_X: 0
      m_Y: 128
      m_Width: 128
      m_Height: 128
    m_Scale: 1
    m_AtlasIndex: 0
    sprite: {fileID: 0}
  - m_Index: 9
    m_Metrics:
      m_Width: 128
      m_Height: 128
      m_HorizontalBearingX: -0
      m_HorizontalBearingY: 115.2
      m_HorizontalAdvance: 128
    m_GlyphRect:
      m_X: 128
      m_Y: 128
      m_Width: 128
      m_Height: 128
    m_Scale: 1
    m_AtlasIndex: 0
    sprite: {fileID: 0}
  - m_Index: 10
    m_Metrics:
      m_Width: 128
      m_Height: 128
      m_HorizontalBearingX: -0
      m_HorizontalBearingY: 115.2
      m_HorizontalAdvance: 128
    m_GlyphRect:
      m_X: 256
      m_Y: 128
      m_Width: 128
      m_Height: 128
    m_Scale: 1
    m_AtlasIndex: 0
    sprite: {fileID: 0}
  - m_Index: 11
    m_Metrics:
      m_Width: 128
      m_Height: 128
      m_HorizontalBearingX: -0
      m_HorizontalBearingY: 115.2
      m_HorizontalAdvance: 128
    m_GlyphRect:
      m_X: 384
      m_Y: 128
      m_Width: 128
      m_Height: 128
    m_Scale: 1
    m_AtlasIndex: 0
    sprite: {fileID: 0}
  - m_Index: 12
    m_Metrics:
      m_Width: 128
      m_Height: 128
      m_HorizontalBearingX: -0
      m_HorizontalBearingY: 115.2
      m_HorizontalAdvance: 128
    m_GlyphRect:
      m_X: 0
      m_Y: 0
      m_Width: 128
      m_Height: 128
    m_Scale: 1
    m_AtlasIndex: 0
    sprite: {fileID: 0}
  - m_Index: 13
    m_Metrics:
      m_Width: 128
      m_Height: 128
      m_HorizontalBearingX: -0
      m_HorizontalBearingY: 115.2
      m_HorizontalAdvance: 128
    m_GlyphRect:
      m_X: 128
      m_Y: 0
      m_Width: 128
      m_Height: 128
    m_Scale: 1
    m_AtlasIndex: 0
    sprite: {fileID: 0}
  - m_Index: 14
    m_Metrics:
      m_Width: 128
      m_Height: 128
      m_HorizontalBearingX: -0
      m_HorizontalBearingY: 115.2
      m_HorizontalAdvance: 128
    m_GlyphRect:
      m_X: 256
      m_Y: 0
      m_Width: 128
      m_Height: 128
    m_Scale: 1
    m_AtlasIndex: 0
    sprite: {fileID: 0}
  - m_Index: 15
    m_Metrics:
      m_Width: 128
      m_Height: 128
      m_HorizontalBearingX: -0
      m_HorizontalBearingY: 115.2
      m_HorizontalAdvance: 128
    m_GlyphRect:
      m_X: 384
      m_Y: 0
      m_Width: 128
      m_Height: 128
    m_Scale: 1
    m_AtlasIndex: 0
    sprite: {fileID: 0}
  spriteInfoList: []
  fallbackSpriteAssets: []
--- !u!21 &4820620802353119283
Material:
  serializedVersion: 6
  m_ObjectHideFlags: 1
  m_CorrespondingSourceObject: {fileID: 0}
  m_PrefabInstance: {fileID: 0}
  m_PrefabAsset: {fileID: 0}
  m_Name: TextMeshPro/Sprite
  m_Shader: {fileID: 4800000, guid: cf81c85f95fe47e1a27f6ae460cf182c, type: 3}
  m_ShaderKeywords: 
  m_LightmapFlags: 4
  m_EnableInstancingVariants: 0
  m_DoubleSidedGI: 0
  m_CustomRenderQueue: -1
  stringTagMap: {}
  disabledShaderPasses: []
  m_SavedProperties:
    serializedVersion: 3
    m_TexEnvs:
    - _MainTex:
        m_Texture: {fileID: 2800000, guid: 3f049e5f25da27849a059fbbb0e98b45, type: 3}
        m_Scale: {x: 1, y: 1}
        m_Offset: {x: 0, y: 0}
    m_Floats:
    - _ColorMask: 15
    - _CullMode: 0
    - _Stencil: 0
    - _StencilComp: 8
    - _StencilOp: 0
    - _StencilReadMask: 255
    - _StencilWriteMask: 255
    - _UseUIAlphaClip: 0
    m_Colors:
    - _ClipRect: {r: -32767, g: -32767, b: 32767, a: 32767}
    - _Color: {r: 1, g: 1, b: 1, a: 1}
  m_BuildTextureStacks: []
