﻿{
  "Replicas": [
    {
      "Speaker": "grandpa",
      "Text": {
        "ru": "Ружьё... моё... любимоё... <Вздох ностальгии>",
        "en": "Shotgun ... my ... beloved ... <Sigh of Nostalgia>"
      }
    },
    {
      "Speaker": "grandpa",
      "Text": {
        "ru": "В семдесят втором году стояла моя часть между Вьетнамом и Черниговом. Поставка сгушенки из Белорусии закончилась и моя часть с голоду дохла(((",
        "en": "In the seventy-second year, my unit was located between Vietnam and Chernigov. The supply of dried milk from Belarus ended and my part of hunger died ((("
      }
    },
    {
      "Speaker": "grandpa",
      "Text": {
        "ru": "Ну и шо нам ещё оставалось делать??? Мы начали питарды взрывать!!!!",
        "en": "Well, sho we still had to do ??? We started to blow up firecrackers!!!!"
      }
    },
    {
      "Speaker": "grandpa",
      "Text": {
        "ru": "У меня ещё сослуживец был, лучший друг, Жора кажеться завали... Так он говорит мол \"Сейчас значит беру 15 литров сгущенки, лью сверху 25 литров пива и ты пьешь всё это дело...\"",
        "en": "I still had a colleague, my best friend, Zhora seems to be blocked up ... So he says they say \"Now I take 15 liters of condensed milk, pour 25 liters of beer on top and you drink the whole thing ... \""
      }
    },
    {
      "Speaker": "grandpa",
      "Text": {
        "ru": "И добавляет \"Если не выпьешь полностью то мы тебя...\" и я не помню дальше что он говорил, ведь я уже пил этот нектар жизни, эту амброзию богов... и дальше все как в тумане...",
        "en": "And he adds \"If you do not drink completely, then we will ... \" and I do not remember what he said next, because I already drank this nectar of life, this ambrosia of the gods ... and then everything is like a fog ..."
      }
    },
    {
      "Speaker": "grandpa",
      "Text": {
        "ru": "<Задумчиво молчит>",
        "en": "<Pensively silent>"
      }
    },
    {
      "Speaker": "grandpa",
      "Text": {
        "ru": "Ну я как проснулся, все белое от этой сгущенки и кровища по колено...",
        "en": "Well, as I woke up, everything was white from this condensed milk and knee-deep blood ..."
      }
    },
    {
      "Speaker": "grandpa",
      "Text": {
        "ru": "Х2<Задумчиво молчит>",
        "en": "X2<Thoughtfully silent>"
      }
    },
    {
      "Speaker": "grandpa",
      "Text": {
        "ru": "ВСССПОМНИЛ!!!!!!!",
        "en": "REMEMBERED!!!!!!!"
      }
    },
    {
      "Speaker": "grandpa",
      "Text": {
        "ru": "Он начал питарды взрывать, а я ему говрю что он дебил и вообще мне кажеться что он не совсем нормальный ведь не предложил мне повзрывать...",
        "en": "He began to blow up firecrackers, and I tell him that he is a moron and in general it seems to me that he is not quite normal, after all, he did not offer me to blow up..."
      }
    },
    {
      "Speaker": "grandpa",
      "Text": {
        "ru": "И я выхватываю у него из рук подожженую питарду, и она как БАБАХНЕТ!!!!!!!!!",
        "en": "And I grab the set fire pitarda from his hands, and she's like a BANG !!!!!!!!!"
      }
    },
    {
      "Speaker": "grandpa",
      "Text": {
        "ru": "Я было подумал что на нас напали...",
        "en": "I thought we were attacked ..."
      }
    },
    {
      "Speaker": "grandpa",
      "Text": {
        "ru": "Достал ружьём давай палить по всему откуда вызрываеться..",
        "en": "I got out a gun, let's fire all over where we get out of there .."
      }
    },
    {
      "Speaker": "grandpa",
      "Text": {
        "ru": "Оказалось что я её не держал в руках, хоть я и был пьяный, но я ведь не глупый...",
        "en": "It turned out that I was not holding it in my hands, even though I was drunk, but I'm not stupid..."
      }
    },
    {
      "Speaker": "grandpa",
      "Text": {
        "ru": "Кинул её к оставшимся питардам.",
        "en": "He threw it to the rest of the pitards."
      }
    },
    {
      "Speaker": "grandpa",
      "Text": {
        "ru": "Хе-хе",
        "en": "He-he"
      }
    }
  ],
  "ChoiceOptions": [
    {
      "NextDialogue": null,
      "Condition": null,
      "Text": {
        "ru": "Идти дальше",
        "en": "Go away"
      },
      "Influence": ""
    }
  ]
}