﻿{
  "Replicas": [
    {
      "Speaker": "grandpa",
      "Text": {
        "ru": "Мои таблетки!",
        "en": "My pills!"
      }
    },
    {
      "Speaker": "grandpa",
      "Text": {
        "ru": "Если я не буду их принимать то скорее всего умру и буду вонять...",
        "en": "If I don’t take them, I’ll most likely die and stink ..."
      }
    },
    {
      "Speaker": "grandpa",
      "Text": {
        "ru": "Моя семья собереться на моих похоронах...",
        "en": "My family will gather at my funeral ..."
      }
    },
    {
      "Speaker": "grandpa",
      "Text": {
        "ru": "Будут скорбеть и плакать, вспоминать меня...",
        "en": "They will grieve and cry, remember me ..."
      }
    },
    {
      "Speaker": "grandpa",
      "Text": {
        "ru": "И кто-то скажет, \"Да-аааа, жаль конечно этого добряка...\" ",
        "en": "And someone will say, \"Yes, ahhh, it's a pity of course this good man ... \" "
      }
    }
  ],
  "ChoiceOptions": [
    {
      "NextDialogue": null,
      "Condition": null,
      "Text": {
        "ru": "Идти дальше",
        "en": "Go away"
      },
      "Influence": ""
    }
  ]
}