# MagicaVoxel @ Ephtracy

# group
o 

# material
mtllib Player.mtl
usemtl palette

# normals
vn 0 0 -1
vn 0 0 1
vn -1 0 0
vn 1 0 0
vn 0 -1 0
vn 0 1 0

# texcoords
vt 0.0332031 0.5
vt 0.845703 0.5
vt 0.849609 0.5
vt 0.966797 0.5
vt 0.974609 0.5
vt 0.994141 0.5

# verts
v -0.5 0 0
v -0.4 0 0
v -0.3 0 0
v -0.2 0 0
v -0.5 0.3 0
v -0.4 0.3 0
v -0.3 0.3 0
v -0.2 0.3 0
v -0.5 0.4 0
v -0.4 0.4 0
v -0.3 0.4 0
v -0.3 0.5 0
v -0.2 0.5 0
v -0.1 0.5 0
v -1.49012e-008 0.5 0
v -0.5 0.6 0
v -0.4 0.6 0
v -0.3 0.6 0
v -0.2 0.6 0
v -0.1 0.6 0
v 0.2 0.6 0
v 0.3 0.6 0
v -0.5 0.7 0
v -0.4 0.7 0
v -0.3 0.7 0
v -0.2 0.7 0
v -1.49012e-008 0.7 0
v 0.1 0.7 0
v 0.2 0.7 0
v 0.3 0.7 0
v -0.5 0.8 0
v -0.4 0.8 0
v -0.2 0.8 0
v -0.1 0.8 0
v -1.49012e-008 0.8 0
v 0.1 0.8 0
v 0.2 0.8 0
v -0.2 0.9 0
v -0.1 0.9 0
v -1.49012e-008 0.9 0
v 0.1 0.9 0
v 0.3 0.9 0
v -0.4 1 0
v -0.3 1 0
v -0.2 1 0
v -0.1 1 0
v -1.49012e-008 1 0
v 0.1 1 0
v -0.3 1.1 0
v -0.1 1.1 0
v -1.49012e-008 1.1 0
v 0.1 1.1 0
v 0.2 1.1 0
v 0.3 1.1 0
v -0.1 1.2 0
v -1.49012e-008 1.2 0
v 0.1 1.2 0
v 0.2 1.2 0
v 0.3 1.2 0
v -0.1 1.3 0
v -1.49012e-008 1.3 0
v 0.3 1.3 0
v -0.5 0 0.1
v -0.4 0 0.1
v -0.3 0 0.1
v -0.2 0 0.1
v -0.5 0.3 0.1
v -0.4 0.3 0.1
v -0.3 0.3 0.1
v -0.2 0.3 0.1
v -0.5 0.4 0.1
v -0.4 0.4 0.1
v -0.3 0.4 0.1
v -0.3 0.5 0.1
v -0.2 0.5 0.1
v -0.1 0.5 0.1
v -1.49012e-008 0.5 0.1
v -0.5 0.6 0.1
v -0.4 0.6 0.1
v -0.3 0.6 0.1
v -0.2 0.6 0.1
v -0.1 0.6 0.1
v 0.2 0.6 0.1
v 0.3 0.6 0.1
v -0.5 0.7 0.1
v -0.4 0.7 0.1
v -0.3 0.7 0.1
v -0.2 0.7 0.1
v -1.49012e-008 0.7 0.1
v 0.1 0.7 0.1
v 0.2 0.7 0.1
v 0.3 0.7 0.1
v -0.5 0.8 0.1
v -0.4 0.8 0.1
v -0.2 0.8 0.1
v -0.1 0.8 0.1
v -1.49012e-008 0.8 0.1
v 0.1 0.8 0.1
v 0.2 0.8 0.1
v -0.2 0.9 0.1
v -0.1 0.9 0.1
v -1.49012e-008 0.9 0.1
v 0.1 0.9 0.1
v 0.3 0.9 0.1
v -0.4 1 0.1
v -0.3 1 0.1
v -0.2 1 0.1
v -0.1 1 0.1
v -1.49012e-008 1 0.1
v 0.1 1 0.1
v -0.3 1.1 0.1
v -0.1 1.1 0.1
v -1.49012e-008 1.1 0.1
v 0.1 1.1 0.1
v 0.2 1.1 0.1
v 0.3 1.1 0.1
v -0.1 1.2 0.1
v -1.49012e-008 1.2 0.1
v 0.1 1.2 0.1
v 0.2 1.2 0.1
v 0.3 1.2 0.1
v -0.1 1.3 0.1
v -1.49012e-008 1.3 0.1
v 0.3 1.3 0.1
v -0.5 0 0
v -0.5 0.3 0
v -0.5 0.4 0
v -0.5 0.6 0
v -0.5 0.7 0
v -0.5 0.8 0
v -0.5 0 0.1
v -0.5 0.3 0.1
v -0.5 0.4 0.1
v -0.5 0.6 0.1
v -0.5 0.7 0.1
v -0.5 0.8 0.1
v -0.4 0.8 0
v -0.4 1 0
v -0.4 0.8 0.1
v -0.4 1 0.1
v -0.3 0 0
v -0.3 0.3 0
v -0.3 1 0
v -0.3 1.1 0
v -0.3 0 0.1
v -0.3 0.3 0.1
v -0.3 1 0.1
v -0.3 1.1 0.1
v -0.1 0.5 0
v -0.1 0.6 0
v -0.1 1.1 0
v -0.1 1.2 0
v -0.1 1.3 0
v -0.1 0.5 0.1
v -0.1 0.6 0.1
v -0.1 1.1 0.1
v -0.1 1.2 0.1
v -0.1 1.3 0.1
v -1.49012e-008 0.8 0
v -1.49012e-008 0.9 0
v -1.49012e-008 0.8 0.1
v -1.49012e-008 0.9 0.1
v 0.1 0.7 0
v 0.1 0.8 0
v 0.1 0.7 0.1
v 0.1 0.8 0.1
v 0.2 0.6 0
v 0.2 0.7 0
v 0.2 0.6 0.1
v 0.2 0.7 0.1
v -0.4 0 0
v -0.4 0.3 0
v -0.4 0 0.1
v -0.4 0.3 0.1
v -0.2 0 0
v -0.2 0.3 0
v -0.2 0.5 0
v -0.2 0.6 0
v -0.2 0.7 0
v -0.2 0.8 0
v -0.2 0 0.1
v -0.2 0.3 0.1
v -0.2 0.5 0.1
v -0.2 0.6 0.1
v -0.2 0.7 0.1
v -0.2 0.8 0.1
v -0.1 0.8 0
v -0.1 0.9 0
v -0.1 0.8 0.1
v -0.1 0.9 0.1
v -1.49012e-008 0.5 0
v -1.49012e-008 0.7 0
v -1.49012e-008 0.5 0.1
v -1.49012e-008 0.7 0.1
v 0.3 0.6 0
v 0.3 0.7 0
v 0.3 0.9 0
v 0.3 1.1 0
v 0.3 1.2 0
v 0.3 1.3 0
v 0.3 0.6 0.1
v 0.3 0.7 0.1
v 0.3 0.9 0.1
v 0.3 1.1 0.1
v 0.3 1.2 0.1
v 0.3 1.3 0.1
v -0.5 0 0
v -0.5 0 0.1
v -0.4 0 0
v -0.4 0 0.1
v -0.3 0 0
v -0.3 0 0.1
v -0.2 0 0
v -0.2 0 0.1
v -0.4 0.3 0
v -0.4 0.3 0.1
v -0.3 0.3 0
v -0.3 0.3 0.1
v -0.1 0.5 0
v -0.1 0.5 0.1
v -1.49012e-008 0.5 0
v -1.49012e-008 0.5 0.1
v -0.2 0.6 0
v -0.2 0.6 0.1
v -0.1 0.6 0
v -0.1 0.6 0.1
v 0.2 0.6 0
v 0.2 0.6 0.1
v 0.3 0.6 0
v 0.3 0.6 0.1
v 0.1 0.7 0
v 0.1 0.7 0.1
v 0.2 0.7 0
v 0.2 0.7 0.1
v -0.2 0.8 0
v -0.2 0.8 0.1
v -0.1 0.8 0
v -0.1 0.8 0.1
v -1.49012e-008 0.8 0
v -1.49012e-008 0.8 0.1
v 0.1 0.8 0
v 0.1 0.8 0.1
v -0.1 0.9 0
v -0.1 0.9 0.1
v -1.49012e-008 0.9 0
v -1.49012e-008 0.9 0.1
v -0.2 0.7 0
v -0.2 0.7 0.1
v -1.49012e-008 0.7 0
v -1.49012e-008 0.7 0.1
v -0.5 0.8 0
v -0.5 0.8 0.1
v -0.4 0.8 0
v -0.4 0.8 0.1
v -0.4 1 0
v -0.4 1 0.1
v -0.3 1 0
v -0.3 1 0.1
v -0.3 1.1 0
v -0.3 1.1 0.1
v -0.1 1.1 0
v -0.1 1.1 0.1
v -0.1 1.3 0
v -0.1 1.3 0.1
v -1.49012e-008 1.3 0
v -1.49012e-008 1.3 0.1
v 0.3 1.3 0
v 0.3 1.3 0.1

# faces
f 5/1/1 2/1/1 1/1/1
f 6/1/1 2/1/1 5/1/1
f 7/1/1 4/1/1 3/1/1
f 8/1/1 4/1/1 7/1/1
f 9/2/1 6/2/1 5/2/1
f 10/3/1 7/3/1 6/3/1
f 10/2/1 6/2/1 9/2/1
f 11/2/1 8/2/1 7/2/1
f 11/3/1 7/3/1 10/3/1
f 12/2/1 11/2/1 10/2/1
f 12/2/1 8/2/1 11/2/1
f 13/2/1 8/2/1 12/2/1
f 16/3/1 10/3/1 9/3/1
f 17/2/1 12/2/1 10/2/1
f 17/3/1 10/3/1 16/3/1
f 18/3/1 13/3/1 12/3/1
f 18/2/1 12/2/1 17/2/1
f 19/3/1 13/3/1 18/3/1
f 20/1/1 15/1/1 14/1/1
f 23/2/1 17/2/1 16/2/1
f 24/3/1 18/3/1 17/3/1
f 24/2/1 17/2/1 23/2/1
f 25/1/1 19/1/1 18/1/1
f 25/3/1 18/3/1 24/3/1
f 25/1/1 20/1/1 19/1/1
f 26/1/1 20/1/1 25/1/1
f 27/1/1 15/1/1 20/1/1
f 27/1/1 20/1/1 26/1/1
f 29/4/1 22/4/1 21/4/1
f 30/4/1 22/4/1 29/4/1
f 31/3/1 24/3/1 23/3/1
f 32/2/1 25/2/1 24/2/1
f 32/3/1 24/3/1 31/3/1
f 33/3/1 26/3/1 25/3/1
f 36/4/1 29/4/1 28/4/1
f 37/5/1 30/5/1 29/5/1
f 37/4/1 29/4/1 36/4/1
f 38/3/1 34/3/1 33/3/1
f 38/3/1 33/3/1 25/3/1
f 39/3/1 34/3/1 38/3/1
f 40/5/1 36/5/1 35/5/1
f 40/5/1 37/5/1 36/5/1
f 41/5/1 37/5/1 40/5/1
f 42/5/1 30/5/1 37/5/1
f 42/5/1 37/5/1 41/5/1
f 43/2/1 25/2/1 32/2/1
f 44/3/1 38/3/1 25/3/1
f 44/2/1 25/2/1 43/2/1
f 45/1/1 39/1/1 38/1/1
f 45/3/1 38/3/1 44/3/1
f 46/5/1 40/5/1 39/5/1
f 46/1/1 39/1/1 45/1/1
f 47/4/1 41/4/1 40/4/1
f 47/5/1 40/5/1 46/5/1
f 48/1/1 42/1/1 41/1/1
f 48/4/1 41/4/1 47/4/1
f 49/1/1 46/1/1 45/1/1
f 49/1/1 45/1/1 44/1/1
f 50/4/1 47/4/1 46/4/1
f 50/1/1 46/1/1 49/1/1
f 51/1/1 48/1/1 47/1/1
f 51/4/1 47/4/1 50/4/1
f 52/1/1 42/1/1 48/1/1
f 52/1/1 48/1/1 51/1/1
f 53/1/1 42/1/1 52/1/1
f 54/1/1 42/1/1 53/1/1
f 55/4/1 51/4/1 50/4/1
f 56/6/1 52/6/1 51/6/1
f 56/4/1 51/4/1 55/4/1
f 57/1/1 53/1/1 52/1/1
f 57/6/1 52/6/1 56/6/1
f 58/6/1 54/6/1 53/6/1
f 58/1/1 53/1/1 57/1/1
f 59/6/1 54/6/1 58/6/1
f 60/5/1 56/5/1 55/5/1
f 61/1/1 57/1/1 56/1/1
f 61/5/1 56/5/1 60/5/1
f 61/1/1 58/1/1 57/1/1
f 61/1/1 59/1/1 58/1/1
f 62/1/1 59/1/1 61/1/1
f 63/1/2 64/1/2 67/1/2
f 67/1/2 64/1/2 68/1/2
f 65/1/2 66/1/2 69/1/2
f 69/1/2 66/1/2 70/1/2
f 67/2/2 68/2/2 71/2/2
f 68/3/2 69/3/2 72/3/2
f 71/2/2 68/2/2 72/2/2
f 69/2/2 70/2/2 73/2/2
f 72/3/2 69/3/2 73/3/2
f 72/2/2 73/2/2 74/2/2
f 73/2/2 70/2/2 74/2/2
f 74/2/2 70/2/2 75/2/2
f 71/3/2 72/3/2 78/3/2
f 72/2/2 74/2/2 79/2/2
f 78/3/2 72/3/2 79/3/2
f 74/3/2 75/3/2 80/3/2
f 79/2/2 74/2/2 80/2/2
f 80/3/2 75/3/2 81/3/2
f 76/1/2 77/1/2 82/1/2
f 78/2/2 79/2/2 85/2/2
f 79/3/2 80/3/2 86/3/2
f 85/2/2 79/2/2 86/2/2
f 80/1/2 81/1/2 87/1/2
f 86/3/2 80/3/2 87/3/2
f 81/1/2 82/1/2 87/1/2
f 87/1/2 82/1/2 88/1/2
f 82/1/2 77/1/2 89/1/2
f 88/1/2 82/1/2 89/1/2
f 83/4/2 84/4/2 91/4/2
f 91/4/2 84/4/2 92/4/2
f 85/3/2 86/3/2 93/3/2
f 86/2/2 87/2/2 94/2/2
f 93/3/2 86/3/2 94/3/2
f 87/3/2 88/3/2 95/3/2
f 90/4/2 91/4/2 98/4/2
f 91/5/2 92/5/2 99/5/2
f 98/4/2 91/4/2 99/4/2
f 95/3/2 96/3/2 100/3/2
f 87/3/2 95/3/2 100/3/2
f 100/3/2 96/3/2 101/3/2
f 97/5/2 98/5/2 102/5/2
f 98/5/2 99/5/2 102/5/2
f 102/5/2 99/5/2 103/5/2
f 99/5/2 92/5/2 104/5/2
f 103/5/2 99/5/2 104/5/2
f 94/2/2 87/2/2 105/2/2
f 87/3/2 100/3/2 106/3/2
f 105/2/2 87/2/2 106/2/2
f 100/1/2 101/1/2 107/1/2
f 106/3/2 100/3/2 107/3/2
f 101/5/2 102/5/2 108/5/2
f 107/1/2 101/1/2 108/1/2
f 102/4/2 103/4/2 109/4/2
f 108/5/2 102/5/2 109/5/2
f 103/1/2 104/1/2 110/1/2
f 109/4/2 103/4/2 110/4/2
f 107/1/2 108/1/2 111/1/2
f 106/1/2 107/1/2 111/1/2
f 108/4/2 109/4/2 112/4/2
f 111/1/2 108/1/2 112/1/2
f 109/1/2 110/1/2 113/1/2
f 112/4/2 109/4/2 113/4/2
f 110/1/2 104/1/2 114/1/2
f 113/1/2 110/1/2 114/1/2
f 114/1/2 104/1/2 115/1/2
f 115/1/2 104/1/2 116/1/2
f 112/4/2 113/4/2 117/4/2
f 113/6/2 114/6/2 118/6/2
f 117/4/2 113/4/2 118/4/2
f 114/1/2 115/1/2 119/1/2
f 118/6/2 114/6/2 119/6/2
f 115/6/2 116/6/2 120/6/2
f 119/1/2 115/1/2 120/1/2
f 120/6/2 116/6/2 121/6/2
f 117/5/2 118/5/2 122/5/2
f 118/1/2 119/1/2 123/1/2
f 122/5/2 118/5/2 123/5/2
f 119/1/2 120/1/2 123/1/2
f 120/1/2 121/1/2 123/1/2
f 123/1/2 121/1/2 124/1/2
f 131/1/3 126/1/3 125/1/3
f 132/2/3 127/2/3 126/2/3
f 132/1/3 126/1/3 131/1/3
f 133/3/3 128/3/3 127/3/3
f 133/2/3 127/2/3 132/2/3
f 134/2/3 129/2/3 128/2/3
f 134/3/3 128/3/3 133/3/3
f 135/3/3 130/3/3 129/3/3
f 135/2/3 129/2/3 134/2/3
f 136/3/3 130/3/3 135/3/3
f 139/2/3 138/2/3 137/2/3
f 140/2/3 138/2/3 139/2/3
f 145/1/3 142/1/3 141/1/3
f 146/1/3 142/1/3 145/1/3
f 147/1/3 144/1/3 143/1/3
f 148/1/3 144/1/3 147/1/3
f 154/1/3 150/1/3 149/1/3
f 155/1/3 150/1/3 154/1/3
f 156/4/3 152/4/3 151/4/3
f 157/5/3 153/5/3 152/5/3
f 157/4/3 152/4/3 156/4/3
f 158/5/3 153/5/3 157/5/3
f 161/5/3 160/5/3 159/5/3
f 162/5/3 160/5/3 161/5/3
f 165/4/3 164/4/3 163/4/3
f 166/4/3 164/4/3 165/4/3
f 169/4/3 168/4/3 167/4/3
f 170/4/3 168/4/3 169/4/3
f 171/1/4 172/1/4 173/1/4
f 173/1/4 172/1/4 174/1/4
f 175/1/4 176/1/4 181/1/4
f 176/2/4 177/2/4 182/2/4
f 181/1/4 176/1/4 182/1/4
f 177/3/4 178/3/4 183/3/4
f 182/2/4 177/2/4 183/2/4
f 183/3/4 178/3/4 184/3/4
f 179/3/4 180/3/4 185/3/4
f 185/3/4 180/3/4 186/3/4
f 187/3/4 188/3/4 189/3/4
f 189/3/4 188/3/4 190/3/4
f 191/1/4 192/1/4 193/1/4
f 193/1/4 192/1/4 194/1/4
f 195/4/4 196/4/4 201/4/4
f 196/5/4 197/5/4 202/5/4
f 201/4/4 196/4/4 202/4/4
f 197/1/4 198/1/4 203/1/4
f 202/5/4 197/5/4 203/5/4
f 198/6/4 199/6/4 204/6/4
f 203/1/4 198/1/4 204/1/4
f 199/1/4 200/1/4 205/1/4
f 204/6/4 199/6/4 205/6/4
f 205/1/4 200/1/4 206/1/4
f 209/1/5 208/1/5 207/1/5
f 210/1/5 208/1/5 209/1/5
f 213/1/5 212/1/5 211/1/5
f 214/1/5 212/1/5 213/1/5
f 217/3/5 216/3/5 215/3/5
f 218/3/5 216/3/5 217/3/5
f 221/1/5 220/1/5 219/1/5
f 222/1/5 220/1/5 221/1/5
f 225/1/5 224/1/5 223/1/5
f 226/1/5 224/1/5 225/1/5
f 229/4/5 228/4/5 227/4/5
f 230/4/5 228/4/5 229/4/5
f 233/4/5 232/4/5 231/4/5
f 234/4/5 232/4/5 233/4/5
f 237/3/5 236/3/5 235/3/5
f 238/3/5 236/3/5 237/3/5
f 241/5/5 240/5/5 239/5/5
f 242/5/5 240/5/5 241/5/5
f 245/5/5 244/5/5 243/5/5
f 246/5/5 244/5/5 245/5/5
f 247/1/6 248/1/6 249/1/6
f 249/1/6 248/1/6 250/1/6
f 251/3/6 252/3/6 253/3/6
f 253/3/6 252/3/6 254/3/6
f 255/2/6 256/2/6 257/2/6
f 257/2/6 256/2/6 258/2/6
f 259/1/6 260/1/6 261/1/6
f 261/1/6 260/1/6 262/1/6
f 263/5/6 264/5/6 265/5/6
f 265/5/6 264/5/6 266/5/6
f 265/1/6 266/1/6 267/1/6
f 267/1/6 266/1/6 268/1/6
