# MagicaVoxel @ Ephtracy

# group
o 

# material
mtllib apple_tree.mtl
usemtl palette

# normals
vn -1 0 0
vn 1 0 0
vn 0 0 1
vn 0 0 -1
vn 0 -1 0
vn 0 1 0

# texcoords
vt 0.0175781 0.5
vt 0.0566406 0.5
vt 0.0605469 0.5
vt 0.201172 0.5

# verts
v -0.9 1.9 0.7
v -0.9 1.9 -0.7
v -0.9 2.1 0.5
v -0.9 2.1 0.4
v -0.9 2.1 -0.4
v -0.9 2.1 -0.5
v -0.9 2.2 0.5
v -0.9 2.2 0.4
v -0.9 2.2 0.3
v -0.9 2.2 -0.3
v -0.9 2.2 -0.4
v -0.9 2.3 -0.5
v -0.9 2.3 -0.7
v -0.9 2.4 0.5
v -0.9 2.4 0.3
v -0.9 2.5 0.3
v -0.9 2.5 -0.3
v -0.9 2.5 -0.5
v -0.9 2.5 -0.7
v -0.9 2.6 0.5
v -0.9 2.6 0.2
v -0.9 2.6 -0.2
v -0.9 2.6 -0.5
v -0.9 2.7 0.2
v -0.9 2.7 -0.2
v -0.9 2.8 0.3
v -0.9 2.8 -0.3
v -0.9 3 0.4
v -0.9 3 0.3
v -0.9 3 0.2
v -0.9 3 0.1
v -0.9 3 -0.1
v -0.9 3 -0.2
v -0.9 3.1 -0.2
v -0.9 3.1 -0.3
v -0.9 3.1 -0.4
v -0.9 3.2 0.4
v -0.9 3.2 0.3
v -0.9 3.2 0.2
v -0.9 3.2 0.1
v -0.9 3.2 -0.1
v -0.9 3.2 -0.3
v -0.9 3.2 -0.4
v -0.9 3.2 -0.5
v -0.9 3.4 0.4
v -0.9 3.4 0.3
v -0.9 3.4 -0.3
v -0.9 3.4 -0.5
v -0.9 3.5 0.7
v -0.9 3.5 -0.7
v -0.8 1.8 0.7
v -0.8 1.8 -0.7
v -0.8 1.9 0.8
v -0.8 1.9 0.7
v -0.8 1.9 -0.7
v -0.8 1.9 -0.8
v -0.8 2 0.9
v -0.8 2 0.8
v -0.8 2 -0.8
v -0.8 2 -0.9
v -0.8 2.3 -0.7
v -0.8 2.5 -0.7
v -0.8 3.4 0.8
v -0.8 3.4 0.7
v -0.8 3.4 -0.7
v -0.8 3.4 -0.9
v -0.8 3.5 0.9
v -0.8 3.5 0.8
v -0.8 3.5 0.7
v -0.8 3.5 0.6
v -0.8 3.5 -0.7
v -0.8 3.5 -0.9
v -0.8 3.6 0.7
v -0.8 3.6 0.6
v -0.8 3.6 -0.7
v -0.7 1.7 0.7
v -0.7 1.7 -0.7
v -0.7 1.8 0.8
v -0.7 1.8 0.7
v -0.7 1.8 -0.7
v -0.7 1.8 -0.8
v -0.7 1.9 0.9
v -0.7 1.9 0.8
v -0.7 1.9 0.7
v -0.7 1.9 -0.7
v -0.7 1.9 -0.8
v -0.7 1.9 -0.9
v -0.7 2 0.9
v -0.7 2 0.8
v -0.7 2 -0.8
v -0.7 2 -0.9
v -0.7 3.5 0.8
v -0.7 3.5 0.7
v -0.7 3.5 -0.7
v -0.7 3.5 -0.8
v -0.7 3.6 0.8
v -0.7 3.6 0.7
v -0.7 3.6 0.6
v -0.7 3.6 -0.7
v -0.7 3.6 -0.8
v -0.7 3.7 0.7
v -0.7 3.7 0.6
v -0.7 3.7 -0.7
v -0.6 1.8 0.9
v -0.6 1.8 0.8
v -0.6 1.8 -0.8
v -0.6 1.8 -0.9
v -0.6 1.9 1
v -0.6 1.9 0.9
v -0.6 1.9 0.8
v -0.6 1.9 -0.8
v -0.6 1.9 -0.9
v -0.6 1.9 -1
v -0.6 2.3 -0.9
v -0.6 2.3 -1
v -0.6 2.5 -0.9
v -0.6 2.5 -1
v -0.6 3.4 -0.9
v -0.6 3.5 1
v -0.6 3.5 0.9
v -0.6 3.5 0.8
v -0.6 3.5 -0.8
v -0.6 3.5 -0.9
v -0.6 3.5 -1
v -0.6 3.6 0.9
v -0.6 3.6 0.8
v -0.6 3.6 0.7
v -0.6 3.6 -0.7
v -0.6 3.6 -0.8
v -0.6 3.6 -0.9
v -0.6 3.7 0.8
v -0.6 3.7 0.7
v -0.6 3.7 0.6
v -0.6 3.7 -0.6
v -0.6 3.7 -0.7
v -0.6 3.7 -0.8
v -0.6 3.8 0.6
v -0.6 3.8 -0.6
v -0.5 3.7 0.7
v -0.5 3.7 0.6
v -0.5 3.7 -0.6
v -0.5 3.7 -0.7
v -0.5 3.8 0.7
v -0.5 3.8 0.6
v -0.5 3.8 -0.6
v -0.5 3.8 -0.7
v -0.3 0 0.2
v -0.3 0 -0.2
v -0.3 1.7 0.2
v -0.3 1.7 -0.2
v -0.2 0 0.3
v -0.2 0 0.2
v -0.2 0 -0.2
v -0.2 0 -0.3
v -0.2 1.7 0.3
v -0.2 1.7 0.2
v -0.2 1.7 -0.2
v -0.2 1.7 -0.3
v 0.2 0 0.3
v 0.2 0 0.2
v 0.2 0 -0.2
v 0.2 0 -0.3
v 0.2 1.7 0.3
v 0.2 1.7 0.2
v 0.2 1.7 -0.2
v 0.2 1.7 -0.3
v 0.3 0 0.2
v 0.3 0 -0.2
v 0.3 1.7 0.2
v 0.3 1.7 -0.2
v 0.5 3.7 0.7
v 0.5 3.7 0.6
v 0.5 3.7 -0.6
v 0.5 3.7 -0.7
v 0.5 3.8 0.7
v 0.5 3.8 0.6
v 0.5 3.8 -0.6
v 0.5 3.8 -0.7
v 0.6 1.8 0.9
v 0.6 1.8 0.8
v 0.6 1.8 -0.8
v 0.6 1.8 -0.9
v 0.6 1.9 1
v 0.6 1.9 0.9
v 0.6 1.9 0.8
v 0.6 1.9 -0.8
v 0.6 1.9 -0.9
v 0.6 1.9 -1
v 0.6 2.3 0.9
v 0.6 2.3 -0.9
v 0.6 2.5 0.9
v 0.6 2.5 -0.9
v 0.6 3 1
v 0.6 3 0.9
v 0.6 3.2 1
v 0.6 3.2 0.9
v 0.6 3.5 1
v 0.6 3.5 0.9
v 0.6 3.5 0.8
v 0.6 3.5 -0.8
v 0.6 3.5 -0.9
v 0.6 3.5 -1
v 0.6 3.6 0.9
v 0.6 3.6 0.8
v 0.6 3.6 0.7
v 0.6 3.6 -0.7
v 0.6 3.6 -0.8
v 0.6 3.6 -0.9
v 0.6 3.7 0.8
v 0.6 3.7 0.7
v 0.6 3.7 0.6
v 0.6 3.7 -0.4
v 0.6 3.7 -0.6
v 0.6 3.7 -0.7
v 0.6 3.7 -0.8
v 0.6 3.8 0.6
v 0.6 3.8 -0.4
v 0.6 3.8 -0.6
v 0.7 1.7 0.7
v 0.7 1.7 -0.7
v 0.7 1.8 0.8
v 0.7 1.8 0.7
v 0.7 1.8 -0.7
v 0.7 1.8 -0.8
v 0.7 1.9 0.9
v 0.7 1.9 0.8
v 0.7 1.9 0.7
v 0.7 1.9 -0.7
v 0.7 1.9 -0.8
v 0.7 1.9 -0.9
v 0.7 2 0.9
v 0.7 2 0.8
v 0.7 2 -0.8
v 0.7 2 -0.9
v 0.7 3.5 0.8
v 0.7 3.5 0.7
v 0.7 3.5 -0.7
v 0.7 3.5 -0.8
v 0.7 3.6 0.8
v 0.7 3.6 0.7
v 0.7 3.6 -0.7
v 0.7 3.6 -0.8
v 0.7 3.7 0.7
v 0.7 3.7 -0.7
v 0.8 1.8 0.7
v 0.8 1.8 -0.7
v 0.8 1.9 0.8
v 0.8 1.9 0.7
v 0.8 1.9 -0.7
v 0.8 1.9 -0.8
v 0.8 2 0.9
v 0.8 2 0.8
v 0.8 2 -0.8
v 0.8 2 -0.9
v 0.8 2.3 0.9
v 0.8 2.3 0.8
v 0.8 2.3 -0.8
v 0.8 2.3 -0.9
v 0.8 2.5 0.9
v 0.8 2.5 0.8
v 0.8 2.5 -0.8
v 0.8 2.5 -0.9
v 0.8 3.5 0.9
v 0.8 3.5 0.7
v 0.8 3.5 0.2
v 0.8 3.5 0
v 0.8 3.5 -0.7
v 0.8 3.5 -0.9
v 0.8 3.6 0.7
v 0.8 3.6 -0.7
v 0.9 1.9 0.7
v 0.9 1.9 -0.7
v 0.9 2 -0.2
v 0.9 2 -0.4
v 0.9 2.1 0.6
v 0.9 2.1 0.4
v 0.9 2.1 -0.4
v 0.9 2.1 -0.5
v 0.9 2.2 0.4
v 0.9 2.2 0.3
v 0.9 2.2 -0.2
v 0.9 2.2 -0.3
v 0.9 2.2 -0.4
v 0.9 2.3 0.6
v 0.9 2.3 0.5
v 0.9 2.3 0.4
v 0.9 2.5 0.3
v 0.9 2.5 -0.3
v 0.9 2.6 0.5
v 0.9 2.6 0.2
v 0.9 2.6 -0.2
v 0.9 2.6 -0.5
v 0.9 2.7 0.2
v 0.9 2.7 -0.2
v 0.9 2.8 0.3
v 0.9 2.8 -0.3
v 0.9 2.9 -0.1
v 0.9 2.9 -0.3
v 0.9 3 0.2
v 0.9 3 0.1
v 0.9 3.1 0.4
v 0.9 3.1 0.3
v 0.9 3.1 0.2
v 0.9 3.1 -0.1
v 0.9 3.1 -0.3
v 0.9 3.1 -0.4
v 0.9 3.2 0.1
v 0.9 3.2 -0.1
v 0.9 3.3 0.2
v 0.9 3.3 0
v 0.9 3.4 0.4
v 0.9 3.4 0.3
v 0.9 3.4 -0.3
v 0.9 3.4 -0.4
v 0.9 3.5 0.7
v 0.9 3.5 0.2
v 0.9 3.5 0
v 0.9 3.5 -0.7
v -0.6 1.9 1
v -0.6 3.5 1
v -0.5 2.1 1
v -0.5 2.3 1
v -0.5 2.8 1
v -0.5 3.3 1
v -0.4 2.7 1
v -0.4 2.8 1
v -0.4 3.1 1
v -0.4 3.3 1
v -0.3 2.1 1
v -0.3 2.3 1
v -0.3 2.5 1
v -0.2 2.1 1
v -0.2 2.2 1
v -0.2 2.3 1
v -0.2 2.4 1
v -0.2 3.1 1
v -0.2 3.3 1
v -0.1 2.2 1
v -0.1 2.3 1
v -0.1 2.5 1
v -0.1 2.7 1
v -0.1 2.9 1
v -0.1 3.1 1
v 0.1 2.2 1
v 0.1 2.3 1
v 0.1 2.5 1
v 0.1 2.7 1
v 0.1 2.9 1
v 0.1 3.1 1
v 0.2 2.1 1
v 0.2 2.2 1
v 0.2 2.3 1
v 0.2 2.4 1
v 0.3 2.1 1
v 0.3 2.5 1
v 0.4 2.7 1
v 0.4 2.8 1
v 0.4 3.3 1
v 0.5 2.8 1
v 0.5 3 1
v 0.5 3.2 1
v 0.5 3.3 1
v 0.6 1.9 1
v 0.6 3 1
v 0.6 3.2 1
v 0.6 3.5 1
v -0.8 2 0.9
v -0.8 3.5 0.9
v -0.7 1.9 0.9
v -0.7 2 0.9
v -0.6 1.8 0.9
v -0.6 1.9 0.9
v -0.6 3.5 0.9
v -0.6 3.6 0.9
v 0.6 1.8 0.9
v 0.6 1.9 0.9
v 0.6 2.3 0.9
v 0.6 2.5 0.9
v 0.6 3 0.9
v 0.6 3.2 0.9
v 0.6 3.5 0.9
v 0.6 3.6 0.9
v 0.7 1.9 0.9
v 0.7 2 0.9
v 0.7 3 0.9
v 0.7 3.2 0.9
v 0.8 2 0.9
v 0.8 2.3 0.9
v 0.8 2.5 0.9
v 0.8 3.5 0.9
v -0.8 1.9 0.8
v -0.8 2 0.8
v -0.7 1.8 0.8
v -0.7 1.9 0.8
v -0.7 2 0.8
v -0.7 3.5 0.8
v -0.7 3.6 0.8
v -0.6 1.8 0.8
v -0.6 1.9 0.8
v -0.6 3.5 0.8
v -0.6 3.6 0.8
v -0.6 3.7 0.8
v 0.6 1.8 0.8
v 0.6 1.9 0.8
v 0.6 3.5 0.8
v 0.6 3.6 0.8
v 0.6 3.7 0.8
v 0.7 1.8 0.8
v 0.7 1.9 0.8
v 0.7 2 0.8
v 0.7 3.5 0.8
v 0.7 3.6 0.8
v 0.8 1.9 0.8
v 0.8 2 0.8
v -0.9 1.9 0.7
v -0.9 3.5 0.7
v -0.8 1.8 0.7
v -0.8 1.9 0.7
v -0.8 3.4 0.7
v -0.8 3.5 0.7
v -0.8 3.6 0.7
v -0.7 1.7 0.7
v -0.7 1.8 0.7
v -0.7 1.9 0.7
v -0.7 3.5 0.7
v -0.7 3.6 0.7
v -0.7 3.7 0.7
v -0.6 3.6 0.7
v -0.6 3.7 0.7
v -0.5 3.7 0.7
v -0.5 3.8 0.7
v 0.3 1.7 0.7
v 0.3 1.8 0.7
v 0.5 1.7 0.7
v 0.5 1.8 0.7
v 0.5 3.7 0.7
v 0.5 3.8 0.7
v 0.6 3.6 0.7
v 0.6 3.7 0.7
v 0.7 1.7 0.7
v 0.7 1.8 0.7
v 0.7 1.9 0.7
v 0.7 3.5 0.7
v 0.7 3.6 0.7
v 0.7 3.7 0.7
v 0.8 1.8 0.7
v 0.8 1.9 0.7
v 0.8 3.5 0.7
v 0.8 3.6 0.7
v 0.9 1.9 0.7
v 0.9 3.5 0.7
v -0.6 3.7 0.6
v -0.6 3.8 0.6
v -0.5 3.7 0.6
v -0.5 3.8 0.6
v 0.5 3.7 0.6
v 0.5 3.8 0.6
v 0.6 3.7 0.6
v 0.6 3.8 0.6
v -0.2 0 0.3
v -0.2 1.7 0.3
v 0.2 0 0.3
v 0.2 1.7 0.3
v -0.3 0 0.2
v -0.3 1.7 0.2
v -0.2 0 0.2
v -0.2 1.7 0.2
v 0.2 0 0.2
v 0.2 1.7 0.2
v 0.3 0 0.2
v 0.3 1.7 0.2
v -0.3 0 -0.2
v -0.3 1.7 -0.2
v -0.2 0 -0.2
v -0.2 1.7 -0.2
v 0.2 0 -0.2
v 0.2 1.7 -0.2
v 0.3 0 -0.2
v 0.3 1.7 -0.2
v -0.2 0 -0.3
v -0.2 1.7 -0.3
v 0.2 0 -0.3
v 0.2 1.7 -0.3
v -0.6 3.7 -0.6
v -0.6 3.8 -0.6
v -0.5 3.7 -0.6
v -0.5 3.8 -0.6
v 0.5 3.7 -0.6
v 0.5 3.8 -0.6
v 0.6 3.7 -0.6
v 0.6 3.8 -0.6
v -0.9 1.9 -0.7
v -0.9 2.3 -0.7
v -0.9 2.5 -0.7
v -0.9 3.5 -0.7
v -0.8 1.8 -0.7
v -0.8 1.9 -0.7
v -0.8 2.3 -0.7
v -0.8 2.5 -0.7
v -0.8 3.4 -0.7
v -0.8 3.5 -0.7
v -0.8 3.6 -0.7
v -0.7 1.7 -0.7
v -0.7 1.8 -0.7
v -0.7 1.9 -0.7
v -0.7 3.5 -0.7
v -0.7 3.6 -0.7
v -0.7 3.7 -0.7
v -0.6 3.6 -0.7
v -0.6 3.7 -0.7
v -0.5 3.7 -0.7
v -0.5 3.8 -0.7
v 0.5 3.7 -0.7
v 0.5 3.8 -0.7
v 0.6 3.6 -0.7
v 0.6 3.7 -0.7
v 0.7 1.7 -0.7
v 0.7 1.8 -0.7
v 0.7 1.9 -0.7
v 0.7 3.5 -0.7
v 0.7 3.6 -0.7
v 0.7 3.7 -0.7
v 0.8 1.8 -0.7
v 0.8 1.9 -0.7
v 0.8 3.5 -0.7
v 0.8 3.6 -0.7
v 0.9 1.9 -0.7
v 0.9 3.5 -0.7
v -0.8 1.9 -0.8
v -0.8 2 -0.8
v -0.7 1.8 -0.8
v -0.7 1.9 -0.8
v -0.7 2 -0.8
v -0.7 3.5 -0.8
v -0.7 3.6 -0.8
v -0.6 1.8 -0.8
v -0.6 1.9 -0.8
v -0.6 3.5 -0.8
v -0.6 3.6 -0.8
v -0.6 3.7 -0.8
v -0.5 3.6 -0.8
v 0.6 1.8 -0.8
v 0.6 1.9 -0.8
v 0.6 3.5 -0.8
v 0.6 3.6 -0.8
v 0.6 3.7 -0.8
v 0.7 1.8 -0.8
v 0.7 1.9 -0.8
v 0.7 2 -0.8
v 0.7 3.5 -0.8
v 0.7 3.6 -0.8
v 0.8 1.9 -0.8
v 0.8 2 -0.8
v -0.8 2 -0.9
v -0.8 3.4 -0.9
v -0.8 3.5 -0.9
v -0.7 1.9 -0.9
v -0.7 2 -0.9
v -0.6 1.8 -0.9
v -0.6 1.9 -0.9
v -0.6 2.3 -0.9
v -0.6 2.5 -0.9
v -0.6 3.4 -0.9
v -0.6 3.5 -0.9
v -0.6 3.6 -0.9
v -0.5 3.5 -0.9
v -0.5 3.6 -0.9
v 0.6 1.8 -0.9
v 0.6 1.9 -0.9
v 0.6 2.3 -0.9
v 0.6 2.5 -0.9
v 0.6 3.5 -0.9
v 0.6 3.6 -0.9
v 0.7 1.9 -0.9
v 0.7 2 -0.9
v 0.8 2 -0.9
v 0.8 2.3 -0.9
v 0.8 2.5 -0.9
v 0.8 3.5 -0.9
v -0.6 1.9 -1
v -0.6 2.3 -1
v -0.6 2.5 -1
v -0.6 3.5 -1
v -0.5 2.8 -1
v -0.5 3.3 -1
v -0.4 2.3 -1
v -0.4 2.5 -1
v -0.4 2.7 -1
v -0.4 2.8 -1
v -0.4 3.3 -1
v -0.3 2.1 -1
v -0.3 2.5 -1
v -0.2 2.1 -1
v -0.2 2.2 -1
v -0.2 2.3 -1
v -0.2 2.4 -1
v -0.1 2.2 -1
v -0.1 2.3 -1
v -0.1 2.5 -1
v -0.1 2.7 -1
v -0.1 2.9 -1
v -0.1 3.1 -1
v 0.1 2.2 -1
v 0.1 2.3 -1
v 0.1 2.5 -1
v 0.1 2.7 -1
v 0.1 2.9 -1
v 0.1 3.1 -1
v 0.2 2.1 -1
v 0.2 2.2 -1
v 0.2 2.3 -1
v 0.2 2.4 -1
v 0.2 2.8 -1
v 0.2 3 -1
v 0.3 2.1 -1
v 0.3 2.5 -1
v 0.4 2.7 -1
v 0.4 2.8 -1
v 0.4 3 -1
v 0.4 3.3 -1
v 0.5 2.8 -1
v 0.5 3.3 -1
v 0.6 1.9 -1
v 0.6 3.5 -1
v -0.2 0 0.3
v 0.2 0 0.3
v -0.3 0 0.2
v -0.2 0 0.2
v 0.2 0 0.2
v 0.3 0 0.2
v -0.3 0 -0.2
v -0.2 0 -0.2
v 0.2 0 -0.2
v 0.3 0 -0.2
v -0.2 0 -0.3
v 0.2 0 -0.3
v -0.7 1.7 0.7
v 0.3 1.7 0.7
v 0.5 1.7 0.7
v 0.7 1.7 0.7
v 0.3 1.7 0.5
v 0.5 1.7 0.5
v -0.2 1.7 0.3
v 0.2 1.7 0.3
v -0.3 1.7 0.2
v -0.2 1.7 0.2
v 0.2 1.7 0.2
v 0.3 1.7 0.2
v -0.3 1.7 -0.2
v -0.2 1.7 -0.2
v 0.2 1.7 -0.2
v 0.3 1.7 -0.2
v -0.2 1.7 -0.3
v 0.2 1.7 -0.3
v -0.7 1.7 -0.7
v 0.7 1.7 -0.7
v -0.6 1.8 0.9
v 0.6 1.8 0.9
v -0.7 1.8 0.8
v -0.6 1.8 0.8
v 0.6 1.8 0.8
v 0.7 1.8 0.8
v -0.8 1.8 0.7
v -0.7 1.8 0.7
v 0.3 1.8 0.7
v 0.5 1.8 0.7
v 0.7 1.8 0.7
v 0.8 1.8 0.7
v -0.8 1.8 -0.7
v -0.7 1.8 -0.7
v 0.7 1.8 -0.7
v 0.8 1.8 -0.7
v -0.7 1.8 -0.8
v -0.6 1.8 -0.8
v 0.6 1.8 -0.8
v 0.7 1.8 -0.8
v -0.6 1.8 -0.9
v 0.6 1.8 -0.9
v -0.6 1.9 1
v 0.6 1.9 1
v -0.7 1.9 0.9
v -0.6 1.9 0.9
v 0.6 1.9 0.9
v 0.7 1.9 0.9
v -0.8 1.9 0.8
v -0.7 1.9 0.8
v -0.6 1.9 0.8
v 0.6 1.9 0.8
v 0.7 1.9 0.8
v 0.8 1.9 0.8
v -0.9 1.9 0.7
v -0.8 1.9 0.7
v -0.7 1.9 0.7
v 0.7 1.9 0.7
v 0.8 1.9 0.7
v 0.9 1.9 0.7
v -0.9 1.9 -0.7
v -0.8 1.9 -0.7
v -0.7 1.9 -0.7
v 0.7 1.9 -0.7
v 0.8 1.9 -0.7
v 0.9 1.9 -0.7
v -0.8 1.9 -0.8
v -0.7 1.9 -0.8
v -0.6 1.9 -0.8
v 0.6 1.9 -0.8
v 0.7 1.9 -0.8
v 0.8 1.9 -0.8
v -0.7 1.9 -0.9
v -0.6 1.9 -0.9
v 0.6 1.9 -0.9
v 0.7 1.9 -0.9
v -0.6 1.9 -1
v 0.6 1.9 -1
v -0.8 2 0.9
v -0.7 2 0.9
v 0.7 2 0.9
v 0.8 2 0.9
v -0.8 2 0.8
v -0.7 2 0.8
v 0.7 2 0.8
v 0.8 2 0.8
v -0.8 2 -0.8
v -0.7 2 -0.8
v 0.7 2 -0.8
v 0.8 2 -0.8
v -0.8 2 -0.9
v -0.7 2 -0.9
v 0.7 2 -0.9
v 0.8 2 -0.9
v -0.6 3.5 1
v 0.6 3.5 1
v -0.8 3.5 0.9
v -0.6 3.5 0.9
v 0.6 3.5 0.9
v 0.8 3.5 0.9
v -0.8 3.5 0.8
v -0.7 3.5 0.8
v -0.6 3.5 0.8
v 0.6 3.5 0.8
v 0.7 3.5 0.8
v -0.9 3.5 0.7
v -0.8 3.5 0.7
v -0.7 3.5 0.7
v 0.7 3.5 0.7
v 0.8 3.5 0.7
v 0.9 3.5 0.7
v -0.8 3.5 0.6
v 0.8 3.5 0.2
v 0.9 3.5 0.2
v 0.8 3.5 0
v 0.9 3.5 0
v -0.9 3.5 -0.7
v -0.8 3.5 -0.7
v -0.7 3.5 -0.7
v 0.7 3.5 -0.7
v 0.8 3.5 -0.7
v 0.9 3.5 -0.7
v -0.7 3.5 -0.8
v -0.6 3.5 -0.8
v 0.6 3.5 -0.8
v 0.7 3.5 -0.8
v -0.8 3.5 -0.9
v -0.6 3.5 -0.9
v -0.5 3.5 -0.9
v 0.6 3.5 -0.9
v 0.8 3.5 -0.9
v -0.6 3.5 -1
v 0.6 3.5 -1
v -0.6 3.6 0.9
v 0.6 3.6 0.9
v -0.7 3.6 0.8
v -0.6 3.6 0.8
v 0.6 3.6 0.8
v 0.7 3.6 0.8
v -0.8 3.6 0.7
v -0.7 3.6 0.7
v -0.6 3.6 0.7
v 0.6 3.6 0.7
v 0.7 3.6 0.7
v 0.8 3.6 0.7
v -0.8 3.6 0.6
v -0.7 3.6 0.6
v -0.8 3.6 -0.7
v -0.7 3.6 -0.7
v -0.6 3.6 -0.7
v 0.6 3.6 -0.7
v 0.7 3.6 -0.7
v 0.8 3.6 -0.7
v -0.7 3.6 -0.8
v -0.6 3.6 -0.8
v -0.5 3.6 -0.8
v 0.6 3.6 -0.8
v 0.7 3.6 -0.8
v -0.6 3.6 -0.9
v -0.5 3.6 -0.9
v 0.6 3.6 -0.9
v -0.6 3.7 0.8
v 0.6 3.7 0.8
v -0.7 3.7 0.7
v -0.6 3.7 0.7
v -0.5 3.7 0.7
v 0.5 3.7 0.7
v 0.6 3.7 0.7
v 0.7 3.7 0.7
v -0.7 3.7 0.6
v -0.6 3.7 0.6
v -0.5 3.7 0.6
v 0.5 3.7 0.6
v 0.6 3.7 0.6
v 0.6 3.7 -0.4
v -0.6 3.7 -0.6
v -0.5 3.7 -0.6
v 0.5 3.7 -0.6
v 0.6 3.7 -0.6
v -0.7 3.7 -0.7
v -0.6 3.7 -0.7
v -0.5 3.7 -0.7
v 0.5 3.7 -0.7
v 0.6 3.7 -0.7
v 0.7 3.7 -0.7
v -0.6 3.7 -0.8
v 0.6 3.7 -0.8
v -0.5 3.8 0.7
v 0.5 3.8 0.7
v -0.6 3.8 0.6
v -0.5 3.8 0.6
v 0.5 3.8 0.6
v 0.6 3.8 0.6
v -0.5 3.8 0.4
v -0.3 3.8 0.4
v -0.5 3.8 0.2
v -0.3 3.8 0.2
v 0.4 3.8 -0.4
v 0.6 3.8 -0.4
v -0.6 3.8 -0.6
v -0.5 3.8 -0.6
v 0.4 3.8 -0.6
v 0.5 3.8 -0.6
v 0.6 3.8 -0.6
v -0.5 3.8 -0.7
v 0.5 3.8 -0.7

# faces
f 3/2/1 2/2/1 1/2/1
f 4/2/1 2/2/1 3/2/1
f 5/2/1 2/2/1 4/2/1
f 6/2/1 2/2/1 5/2/1
f 7/2/1 3/2/1 1/2/1
f 7/3/1 4/3/1 3/3/1
f 8/2/1 5/2/1 4/2/1
f 8/3/1 4/3/1 7/3/1
f 9/2/1 5/2/1 8/2/1
f 10/2/1 5/2/1 9/2/1
f 11/3/1 6/3/1 5/3/1
f 11/2/1 5/2/1 10/2/1
f 12/2/1 2/2/1 6/2/1
f 12/3/1 6/3/1 11/3/1
f 12/3/1 11/3/1 10/3/1
f 13/2/1 2/2/1 12/2/1
f 14/4/1 9/4/1 8/4/1
f 14/2/1 7/2/1 1/2/1
f 14/4/1 8/4/1 7/4/1
f 15/2/1 10/2/1 9/2/1
f 15/4/1 9/4/1 14/4/1
f 16/3/1 15/3/1 14/3/1
f 16/2/1 10/2/1 15/2/1
f 17/3/1 12/3/1 10/3/1
f 17/2/1 10/2/1 16/2/1
f 18/4/1 13/4/1 12/4/1
f 18/3/1 12/3/1 17/3/1
f 19/4/1 13/4/1 18/4/1
f 20/2/1 14/2/1 1/2/1
f 20/3/1 17/3/1 16/3/1
f 20/3/1 16/3/1 14/3/1
f 20/3/1 18/3/1 17/3/1
f 21/3/1 18/3/1 20/3/1
f 22/3/1 18/3/1 21/3/1
f 23/2/1 19/2/1 18/2/1
f 23/3/1 18/3/1 22/3/1
f 24/3/1 22/3/1 21/3/1
f 24/2/1 21/2/1 20/2/1
f 25/2/1 23/2/1 22/2/1
f 25/3/1 22/3/1 24/3/1
f 26/2/1 24/2/1 20/2/1
f 26/2/1 25/2/1 24/2/1
f 27/2/1 23/2/1 25/2/1
f 27/2/1 25/2/1 26/2/1
f 28/2/1 26/2/1 20/2/1
f 29/3/1 27/3/1 26/3/1
f 29/2/1 26/2/1 28/2/1
f 30/3/1 27/3/1 29/3/1
f 31/3/1 27/3/1 30/3/1
f 32/3/1 27/3/1 31/3/1
f 33/3/1 27/3/1 32/3/1
f 34/2/1 33/2/1 32/2/1
f 34/3/1 27/3/1 33/3/1
f 35/2/1 23/2/1 27/2/1
f 35/3/1 27/3/1 34/3/1
f 36/2/1 23/2/1 35/2/1
f 37/2/1 28/2/1 20/2/1
f 37/4/1 29/4/1 28/4/1
f 37/4/1 30/4/1 29/4/1
f 38/4/1 30/4/1 37/4/1
f 39/2/1 31/2/1 30/2/1
f 39/4/1 30/4/1 38/4/1
f 40/3/1 32/3/1 31/3/1
f 40/2/1 31/2/1 39/2/1
f 41/2/1 34/2/1 32/2/1
f 41/3/1 32/3/1 40/3/1
f 41/2/1 35/2/1 34/2/1
f 42/3/1 36/3/1 35/3/1
f 42/2/1 35/2/1 41/2/1
f 43/2/1 23/2/1 36/2/1
f 43/3/1 36/3/1 42/3/1
f 44/2/1 19/2/1 23/2/1
f 44/2/1 23/2/1 43/2/1
f 45/2/1 37/2/1 20/2/1
f 45/3/1 38/3/1 37/3/1
f 46/2/1 40/2/1 39/2/1
f 46/3/1 38/3/1 45/3/1
f 46/2/1 42/2/1 41/2/1
f 46/2/1 39/2/1 38/2/1
f 46/2/1 41/2/1 40/2/1
f 47/4/1 43/4/1 42/4/1
f 47/2/1 42/2/1 46/2/1
f 47/4/1 44/4/1 43/4/1
f 48/2/1 19/2/1 44/2/1
f 48/4/1 44/4/1 47/4/1
f 49/2/1 46/2/1 45/2/1
f 49/2/1 20/2/1 1/2/1
f 49/2/1 48/2/1 47/2/1
f 49/2/1 47/2/1 46/2/1
f 49/2/1 45/2/1 20/2/1
f 50/2/1 19/2/1 48/2/1
f 50/2/1 48/2/1 49/2/1
f 54/2/1 52/2/1 51/2/1
f 55/2/1 52/2/1 54/2/1
f 58/2/1 54/2/1 53/2/1
f 59/2/1 56/2/1 55/2/1
f 61/2/1 59/2/1 55/2/1
f 61/2/1 60/2/1 59/2/1
f 62/2/1 60/2/1 61/2/1
f 63/2/1 58/2/1 57/2/1
f 63/2/1 54/2/1 58/2/1
f 64/2/1 54/2/1 63/2/1
f 65/2/1 60/2/1 62/2/1
f 66/2/1 60/2/1 65/2/1
f 67/2/1 63/2/1 57/2/1
f 68/4/1 64/4/1 63/4/1
f 68/2/1 63/2/1 67/2/1
f 69/4/1 64/4/1 68/4/1
f 71/4/1 66/4/1 65/4/1
f 72/4/1 66/4/1 71/4/1
f 73/4/1 70/4/1 69/4/1
f 74/2/1 71/2/1 70/2/1
f 74/4/1 70/4/1 73/4/1
f 75/2/1 71/2/1 74/2/1
f 79/2/1 77/2/1 76/2/1
f 80/2/1 77/2/1 79/2/1
f 83/2/1 79/2/1 78/2/1
f 84/2/1 79/2/1 83/2/1
f 85/2/1 81/2/1 80/2/1
f 86/2/1 81/2/1 85/2/1
f 88/2/1 83/2/1 82/2/1
f 89/2/1 83/2/1 88/2/1
f 90/2/1 87/2/1 86/2/1
f 91/2/1 87/2/1 90/2/1
f 96/4/1 93/4/1 92/4/1
f 97/4/1 93/4/1 96/4/1
f 99/4/1 95/4/1 94/4/1
f 100/4/1 95/4/1 99/4/1
f 101/4/1 98/4/1 97/4/1
f 102/2/1 99/2/1 98/2/1
f 102/4/1 98/4/1 101/4/1
f 103/2/1 99/2/1 102/2/1
f 109/2/1 105/2/1 104/2/1
f 110/2/1 105/2/1 109/2/1
f 111/2/1 107/2/1 106/2/1
f 112/2/1 107/2/1 111/2/1
f 114/2/1 113/2/1 112/2/1
f 115/2/1 113/2/1 114/2/1
f 116/4/1 115/4/1 114/4/1
f 117/4/1 115/4/1 116/4/1
f 118/2/1 117/2/1 116/2/1
f 119/2/1 109/2/1 108/2/1
f 120/2/1 109/2/1 119/2/1
f 123/2/1 117/2/1 118/2/1
f 124/2/1 117/2/1 123/2/1
f 125/2/1 121/2/1 120/2/1
f 126/2/1 121/2/1 125/2/1
f 129/4/1 123/4/1 122/4/1
f 130/4/1 123/4/1 129/4/1
f 131/2/1 127/2/1 126/2/1
f 132/2/1 127/2/1 131/2/1
f 135/2/1 129/2/1 128/2/1
f 136/2/1 129/2/1 135/2/1
f 137/2/1 134/2/1 133/2/1
f 138/2/1 134/2/1 137/2/1
f 143/2/1 140/2/1 139/2/1
f 144/2/1 140/2/1 143/2/1
f 145/2/1 142/2/1 141/2/1
f 146/2/1 142/2/1 145/2/1
f 149/1/1 148/1/1 147/1/1
f 150/1/1 148/1/1 149/1/1
f 155/1/1 152/1/1 151/1/1
f 156/1/1 152/1/1 155/1/1
f 157/1/1 154/1/1 153/1/1
f 158/1/1 154/1/1 157/1/1
f 159/1/2 160/1/2 163/1/2
f 163/1/2 160/1/2 164/1/2
f 161/1/2 162/1/2 165/1/2
f 165/1/2 162/1/2 166/1/2
f 167/1/2 168/1/2 169/1/2
f 169/1/2 168/1/2 170/1/2
f 171/2/2 172/2/2 175/2/2
f 175/2/2 172/2/2 176/2/2
f 173/2/2 174/2/2 177/2/2
f 177/2/2 174/2/2 178/2/2
f 179/2/2 180/2/2 184/2/2
f 184/2/2 180/2/2 185/2/2
f 181/2/2 182/2/2 186/2/2
f 186/2/2 182/2/2 187/2/2
f 183/2/2 184/2/2 189/2/2
f 187/2/2 188/2/2 190/2/2
f 183/2/2 189/2/2 191/2/2
f 190/2/2 188/2/2 192/2/2
f 183/2/2 191/2/2 193/2/2
f 193/2/2 191/2/2 194/2/2
f 193/4/2 194/4/2 195/4/2
f 195/4/2 194/4/2 196/4/2
f 195/2/2 196/2/2 197/2/2
f 197/2/2 196/2/2 198/2/2
f 192/2/2 188/2/2 201/2/2
f 201/2/2 188/2/2 202/2/2
f 198/2/2 199/2/2 203/2/2
f 203/2/2 199/2/2 204/2/2
f 200/2/2 201/2/2 207/2/2
f 207/2/2 201/2/2 208/2/2
f 204/2/2 205/2/2 209/2/2
f 209/2/2 205/2/2 210/2/2
f 206/2/2 207/2/2 214/2/2
f 214/2/2 207/2/2 215/2/2
f 211/2/2 212/2/2 216/2/2
f 212/4/2 213/4/2 217/4/2
f 216/2/2 212/2/2 217/2/2
f 217/4/2 213/4/2 218/4/2
f 219/2/2 220/2/2 222/2/2
f 222/2/2 220/2/2 223/2/2
f 221/2/2 222/2/2 226/2/2
f 226/2/2 222/2/2 227/2/2
f 223/2/2 224/2/2 228/2/2
f 228/2/2 224/2/2 229/2/2
f 225/2/2 226/2/2 231/2/2
f 231/2/2 226/2/2 232/2/2
f 229/2/2 230/2/2 233/2/2
f 233/2/2 230/2/2 234/2/2
f 235/2/2 236/2/2 239/2/2
f 239/2/2 236/2/2 240/2/2
f 237/2/2 238/2/2 241/2/2
f 241/2/2 238/2/2 242/2/2
f 240/2/2 241/2/2 243/2/2
f 243/2/2 241/2/2 244/2/2
f 245/2/2 246/2/2 248/2/2
f 248/2/2 246/2/2 249/2/2
f 247/2/2 248/2/2 252/2/2
f 249/2/2 250/2/2 253/2/2
f 251/2/2 252/2/2 255/2/2
f 252/2/2 248/2/2 256/2/2
f 255/2/2 252/2/2 256/2/2
f 253/2/2 254/2/2 257/2/2
f 249/2/2 253/2/2 257/2/2
f 257/2/2 254/2/2 258/2/2
f 255/4/2 256/4/2 259/4/2
f 256/2/2 248/2/2 260/2/2
f 259/4/2 256/4/2 260/4/2
f 249/2/2 257/2/2 261/2/2
f 257/4/2 258/4/2 261/4/2
f 261/4/2 258/4/2 262/4/2
f 259/2/2 260/2/2 263/2/2
f 260/2/2 248/2/2 264/2/2
f 263/2/2 260/2/2 264/2/2
f 249/2/2 261/2/2 267/2/2
f 261/2/2 262/2/2 267/2/2
f 267/2/2 262/2/2 268/2/2
f 265/2/2 266/2/2 269/2/2
f 264/2/2 265/2/2 269/2/2
f 266/2/2 267/2/2 269/2/2
f 269/2/2 267/2/2 270/2/2
f 271/2/2 272/2/2 273/2/2
f 273/2/2 272/2/2 274/2/2
f 271/2/2 273/2/2 275/2/2
f 275/2/2 273/2/2 276/2/2
f 274/2/2 272/2/2 277/2/2
f 273/4/2 274/4/2 277/4/2
f 277/2/2 272/2/2 278/2/2
f 276/2/2 273/2/2 279/2/2
f 275/4/2 276/4/2 279/4/2
f 279/2/2 273/2/2 280/2/2
f 273/4/2 277/4/2 281/4/2
f 280/2/2 273/2/2 281/2/2
f 281/4/2 277/4/2 282/4/2
f 277/3/2 278/3/2 283/3/2
f 282/4/2 277/4/2 283/4/2
f 271/2/2 275/2/2 284/2/2
f 275/4/2 279/4/2 284/4/2
f 284/4/2 279/4/2 285/4/2
f 279/3/2 280/3/2 286/3/2
f 285/4/2 279/4/2 286/4/2
f 281/2/2 282/2/2 287/2/2
f 286/3/2 280/3/2 287/3/2
f 285/3/2 286/3/2 287/3/2
f 280/2/2 281/2/2 287/2/2
f 282/3/2 283/3/2 288/3/2
f 287/2/2 282/2/2 288/2/2
f 284/2/2 285/2/2 289/2/2
f 285/3/2 287/3/2 289/3/2
f 287/3/2 288/3/2 289/3/2
f 289/3/2 288/3/2 290/3/2
f 290/3/2 288/3/2 291/3/2
f 278/2/2 272/2/2 292/2/2
f 291/3/2 288/3/2 292/3/2
f 283/3/2 278/3/2 292/3/2
f 288/3/2 283/3/2 292/3/2
f 290/3/2 291/3/2 293/3/2
f 289/2/2 290/2/2 293/2/2
f 291/2/2 292/2/2 294/2/2
f 293/3/2 291/3/2 294/3/2
f 289/2/2 293/2/2 295/2/2
f 293/2/2 294/2/2 295/2/2
f 294/2/2 292/2/2 296/2/2
f 295/2/2 294/2/2 296/2/2
f 295/3/2 296/3/2 297/3/2
f 296/2/2 292/2/2 298/2/2
f 297/3/2 296/3/2 298/3/2
f 295/3/2 297/3/2 299/3/2
f 299/3/2 297/3/2 300/3/2
f 289/2/2 295/2/2 301/2/2
f 295/3/2 299/3/2 302/3/2
f 301/2/2 295/2/2 302/2/2
f 299/2/2 300/2/2 303/2/2
f 302/3/2 299/3/2 303/3/2
f 300/3/2 297/3/2 304/3/2
f 297/4/2 298/4/2 304/4/2
f 298/2/2 292/2/2 305/2/2
f 304/4/2 298/4/2 305/4/2
f 305/2/2 292/2/2 306/2/2
f 303/2/2 300/2/2 307/2/2
f 300/3/2 304/3/2 307/3/2
f 302/2/2 303/2/2 307/2/2
f 304/2/2 305/2/2 308/2/2
f 307/3/2 304/3/2 308/3/2
f 302/2/2 307/2/2 309/2/2
f 307/2/2 308/2/2 309/2/2
f 309/2/2 308/2/2 310/2/2
f 289/2/2 301/2/2 311/2/2
f 301/3/2 302/3/2 311/3/2
f 302/2/2 309/2/2 312/2/2
f 311/3/2 302/3/2 312/3/2
f 305/3/2 306/3/2 313/3/2
f 308/2/2 305/2/2 313/2/2
f 310/2/2 308/2/2 313/2/2
f 306/2/2 292/2/2 314/2/2
f 313/3/2 306/3/2 314/3/2
f 271/2/2 284/2/2 315/2/2
f 284/2/2 289/2/2 315/2/2
f 311/2/2 312/2/2 315/2/2
f 289/2/2 311/2/2 315/2/2
f 312/2/2 309/2/2 316/2/2
f 315/2/2 312/2/2 316/2/2
f 309/4/2 310/4/2 316/4/2
f 310/2/2 313/2/2 317/2/2
f 316/4/2 310/4/2 317/4/2
f 313/2/2 314/2/2 317/2/2
f 292/2/2 272/2/2 318/2/2
f 317/2/2 314/2/2 318/2/2
f 314/2/2 292/2/2 318/2/2
f 321/2/3 320/2/3 319/2/3
f 322/2/3 320/2/3 321/2/3
f 323/2/3 320/2/3 322/2/3
f 324/2/3 320/2/3 323/2/3
f 325/2/3 323/2/3 322/2/3
f 326/3/3 324/3/3 323/3/3
f 326/2/3 323/2/3 325/2/3
f 327/3/3 324/3/3 326/3/3
f 328/2/3 320/2/3 324/2/3
f 328/3/3 324/3/3 327/3/3
f 329/2/3 321/2/3 319/2/3
f 329/4/3 322/4/3 321/4/3
f 330/2/3 325/2/3 322/2/3
f 330/4/3 322/4/3 329/4/3
f 331/2/3 325/2/3 330/2/3
f 332/2/3 329/2/3 319/2/3
f 332/3/3 330/3/3 329/3/3
f 332/3/3 331/3/3 330/3/3
f 333/3/3 331/3/3 332/3/3
f 334/3/3 331/3/3 333/3/3
f 335/3/3 331/3/3 334/3/3
f 336/4/3 328/4/3 327/4/3
f 336/2/3 327/2/3 326/2/3
f 337/2/3 320/2/3 328/2/3
f 337/4/3 328/4/3 336/4/3
f 338/2/3 333/2/3 332/2/3
f 338/3/3 334/3/3 333/3/3
f 339/2/3 335/2/3 334/2/3
f 339/3/3 334/3/3 338/3/3
f 340/3/3 331/3/3 335/3/3
f 340/2/3 325/2/3 331/2/3
f 341/3/3 326/3/3 325/3/3
f 341/2/3 325/2/3 340/2/3
f 342/2/3 336/2/3 326/2/3
f 342/2/3 337/2/3 336/2/3
f 343/2/3 337/2/3 342/2/3
f 344/2/3 338/2/3 332/2/3
f 344/2/3 339/2/3 338/2/3
f 345/2/3 335/2/3 339/2/3
f 345/2/3 339/2/3 344/2/3
f 346/3/3 340/3/3 335/3/3
f 346/3/3 341/3/3 340/3/3
f 347/3/3 326/3/3 341/3/3
f 347/3/3 341/3/3 346/3/3
f 348/3/3 343/3/3 342/3/3
f 348/2/3 342/2/3 326/2/3
f 349/2/3 337/2/3 343/2/3
f 349/3/3 343/3/3 348/3/3
f 350/2/3 344/2/3 332/2/3
f 350/2/3 332/2/3 319/2/3
f 351/3/3 345/3/3 344/3/3
f 351/2/3 344/2/3 350/2/3
f 352/2/3 335/2/3 345/2/3
f 352/3/3 345/3/3 351/3/3
f 353/3/3 346/3/3 335/3/3
f 353/2/3 335/2/3 352/2/3
f 354/3/3 352/3/3 351/3/3
f 354/3/3 351/3/3 350/3/3
f 354/3/3 353/3/3 352/3/3
f 354/2/3 350/2/3 319/2/3
f 355/3/3 346/3/3 353/3/3
f 355/3/3 353/3/3 354/3/3
f 355/2/3 347/2/3 346/2/3
f 356/3/3 326/3/3 347/3/3
f 356/2/3 347/2/3 355/2/3
f 356/2/3 355/2/3 354/2/3
f 357/2/3 348/2/3 326/2/3
f 357/3/3 326/3/3 356/3/3
f 357/2/3 349/2/3 348/2/3
f 358/2/3 337/2/3 349/2/3
f 358/2/3 349/2/3 357/2/3
f 358/2/3 320/2/3 337/2/3
f 359/2/3 357/2/3 356/2/3
f 359/3/3 358/3/3 357/3/3
f 360/3/3 358/3/3 359/3/3
f 361/3/3 358/3/3 360/3/3
f 362/2/3 320/2/3 358/2/3
f 362/3/3 358/3/3 361/3/3
f 363/2/3 354/2/3 319/2/3
f 363/2/3 356/2/3 354/2/3
f 363/2/3 359/2/3 356/2/3
f 363/2/3 360/2/3 359/2/3
f 364/4/3 361/4/3 360/4/3
f 364/2/3 360/2/3 363/2/3
f 365/2/3 362/2/3 361/2/3
f 365/4/3 361/4/3 364/4/3
f 366/2/3 320/2/3 362/2/3
f 366/2/3 362/2/3 365/2/3
f 370/2/3 368/2/3 367/2/3
f 372/2/3 370/2/3 369/2/3
f 373/2/3 368/2/3 370/2/3
f 373/2/3 370/2/3 372/2/3
f 375/2/3 372/2/3 371/2/3
f 376/2/3 372/2/3 375/2/3
f 381/2/3 374/2/3 373/2/3
f 382/2/3 374/2/3 381/2/3
f 383/2/3 377/2/3 376/2/3
f 384/2/3 377/2/3 383/2/3
f 385/4/3 380/4/3 379/4/3
f 385/2/3 379/2/3 378/2/3
f 386/2/3 381/2/3 380/2/3
f 386/4/3 380/4/3 385/4/3
f 387/2/3 377/2/3 384/2/3
f 388/4/3 378/4/3 377/4/3
f 388/2/3 377/2/3 387/2/3
f 389/2/3 385/2/3 378/2/3
f 389/4/3 378/4/3 388/4/3
f 389/2/3 386/2/3 385/2/3
f 390/2/3 381/2/3 386/2/3
f 390/2/3 386/2/3 389/2/3
f 394/2/3 392/2/3 391/2/3
f 395/2/3 392/2/3 394/2/3
f 398/2/3 394/2/3 393/2/3
f 399/2/3 394/2/3 398/2/3
f 400/4/3 397/4/3 396/4/3
f 401/4/3 397/4/3 400/4/3
f 406/2/3 402/2/3 401/2/3
f 407/2/3 402/2/3 406/2/3
f 408/2/3 404/2/3 403/2/3
f 409/2/3 404/2/3 408/2/3
f 411/2/3 406/2/3 405/2/3
f 412/2/3 406/2/3 411/2/3
f 413/2/3 410/2/3 409/2/3
f 414/2/3 410/2/3 413/2/3
f 418/2/3 416/2/3 415/2/3
f 419/2/3 416/2/3 418/2/3
f 420/2/3 416/2/3 419/2/3
f 423/2/3 418/2/3 417/2/3
f 424/2/3 418/2/3 423/2/3
f 425/4/3 421/4/3 420/4/3
f 426/4/3 421/4/3 425/4/3
f 428/4/3 427/4/3 426/4/3
f 429/4/3 427/4/3 428/4/3
f 432/2/3 423/2/3 422/2/3
f 433/2/3 423/2/3 432/2/3
f 434/4/3 433/4/3 432/4/3
f 435/4/3 433/4/3 434/4/3
f 436/2/3 431/2/3 430/2/3
f 437/2/3 431/2/3 436/2/3
f 440/2/3 435/2/3 434/2/3
f 441/2/3 435/2/3 440/2/3
f 444/2/3 439/2/3 438/2/3
f 445/2/3 439/2/3 444/2/3
f 446/2/3 442/2/3 441/2/3
f 447/2/3 442/2/3 446/2/3
f 448/2/3 444/2/3 443/2/3
f 449/2/3 444/2/3 448/2/3
f 450/2/3 448/2/3 447/2/3
f 451/2/3 448/2/3 450/2/3
f 454/2/3 453/2/3 452/2/3
f 455/2/3 453/2/3 454/2/3
f 458/2/3 457/2/3 456/2/3
f 459/2/3 457/2/3 458/2/3
f 462/1/3 461/1/3 460/1/3
f 463/1/3 461/1/3 462/1/3
f 466/1/3 465/1/3 464/1/3
f 467/1/3 465/1/3 466/1/3
f 470/1/3 469/1/3 468/1/3
f 471/1/3 469/1/3 470/1/3
f 472/1/4 473/1/4 474/1/4
f 474/1/4 473/1/4 475/1/4
f 476/1/4 477/1/4 478/1/4
f 478/1/4 477/1/4 479/1/4
f 480/1/4 481/1/4 482/1/4
f 482/1/4 481/1/4 483/1/4
f 484/2/4 485/2/4 486/2/4
f 486/2/4 485/2/4 487/2/4
f 488/4/4 489/4/4 490/4/4
f 490/4/4 489/4/4 491/4/4
f 492/2/4 493/2/4 497/2/4
f 493/4/4 494/4/4 498/4/4
f 497/2/4 493/2/4 498/2/4
f 494/2/4 495/2/4 499/2/4
f 498/4/4 494/4/4 499/4/4
f 499/2/4 495/2/4 500/2/4
f 500/2/4 495/2/4 501/2/4
f 496/2/4 497/2/4 504/2/4
f 504/2/4 497/2/4 505/2/4
f 501/2/4 502/2/4 506/2/4
f 506/2/4 502/2/4 507/2/4
f 507/2/4 508/2/4 509/2/4
f 509/2/4 508/2/4 510/2/4
f 511/2/4 512/2/4 513/2/4
f 513/2/4 512/2/4 514/2/4
f 503/2/4 504/2/4 517/2/4
f 517/2/4 504/2/4 518/2/4
f 515/2/4 516/2/4 521/2/4
f 521/2/4 516/2/4 522/2/4
f 518/2/4 519/2/4 523/2/4
f 523/2/4 519/2/4 524/2/4
f 520/2/4 521/2/4 525/2/4
f 525/2/4 521/2/4 526/2/4
f 524/2/4 525/2/4 527/2/4
f 527/2/4 525/2/4 528/2/4
f 529/2/4 530/2/4 532/2/4
f 532/2/4 530/2/4 533/2/4
f 531/2/4 532/2/4 536/2/4
f 536/2/4 532/2/4 537/2/4
f 534/4/4 535/4/4 538/4/4
f 538/4/4 535/4/4 539/4/4
f 539/2/4 540/2/4 541/2/4
f 541/2/4 540/2/4 545/2/4
f 545/2/4 540/2/4 546/2/4
f 542/2/4 543/2/4 547/2/4
f 547/2/4 543/2/4 548/2/4
f 544/2/4 545/2/4 550/2/4
f 550/2/4 545/2/4 551/2/4
f 548/2/4 549/2/4 552/2/4
f 552/2/4 549/2/4 553/2/4
f 554/2/4 555/2/4 558/2/4
f 557/2/4 558/2/4 560/2/4
f 558/2/4 555/2/4 561/2/4
f 560/2/4 558/2/4 561/2/4
f 561/2/4 555/2/4 562/2/4
f 555/4/4 556/4/4 563/4/4
f 562/2/4 555/2/4 563/2/4
f 563/4/4 556/4/4 564/4/4
f 564/4/4 565/4/4 566/4/4
f 566/4/4 565/4/4 567/4/4
f 559/2/4 560/2/4 568/2/4
f 568/2/4 560/2/4 569/2/4
f 566/2/4 567/2/4 572/2/4
f 572/2/4 567/2/4 573/2/4
f 569/2/4 570/2/4 574/2/4
f 574/2/4 570/2/4 575/2/4
f 575/2/4 570/2/4 576/2/4
f 570/4/4 571/4/4 577/4/4
f 576/2/4 570/2/4 577/2/4
f 571/2/4 572/2/4 578/2/4
f 577/4/4 571/4/4 578/4/4
f 578/2/4 572/2/4 579/2/4
f 582/2/4 583/2/4 584/2/4
f 584/2/4 583/2/4 585/2/4
f 580/2/4 581/2/4 586/2/4
f 581/4/4 582/4/4 586/4/4
f 582/2/4 584/2/4 587/2/4
f 586/4/4 582/4/4 587/4/4
f 587/2/4 584/2/4 588/2/4
f 584/3/4 585/3/4 589/3/4
f 588/2/4 584/2/4 589/2/4
f 585/2/4 583/2/4 590/2/4
f 589/3/4 585/3/4 590/3/4
f 587/2/4 588/2/4 591/2/4
f 580/2/4 586/2/4 591/2/4
f 586/2/4 587/2/4 591/2/4
f 591/2/4 588/2/4 592/2/4
f 580/2/4 591/2/4 593/2/4
f 591/3/4 592/3/4 593/3/4
f 593/3/4 592/3/4 594/3/4
f 594/3/4 592/3/4 595/3/4
f 595/3/4 592/3/4 596/3/4
f 593/2/4 594/2/4 597/2/4
f 594/3/4 595/3/4 597/3/4
f 595/2/4 596/2/4 598/2/4
f 597/3/4 595/3/4 598/3/4
f 592/2/4 588/2/4 599/2/4
f 596/3/4 592/3/4 599/3/4
f 588/3/4 589/3/4 600/3/4
f 599/2/4 588/2/4 600/2/4
f 589/2/4 590/2/4 601/2/4
f 601/2/4 590/2/4 602/2/4
f 597/2/4 598/2/4 603/2/4
f 593/2/4 597/2/4 603/2/4
f 598/2/4 596/2/4 604/2/4
f 603/2/4 598/2/4 604/2/4
f 596/3/4 599/3/4 605/3/4
f 599/3/4 600/3/4 605/3/4
f 600/3/4 589/3/4 606/3/4
f 605/3/4 600/3/4 606/3/4
f 601/3/4 602/3/4 607/3/4
f 589/2/4 601/2/4 607/2/4
f 602/2/4 590/2/4 608/2/4
f 607/3/4 602/3/4 608/3/4
f 593/2/4 603/2/4 609/2/4
f 580/2/4 593/2/4 609/2/4
f 603/3/4 604/3/4 610/3/4
f 609/2/4 603/2/4 610/2/4
f 604/2/4 596/2/4 611/2/4
f 610/3/4 604/3/4 611/3/4
f 596/3/4 605/3/4 612/3/4
f 611/2/4 596/2/4 612/2/4
f 607/2/4 608/2/4 613/2/4
f 589/2/4 607/2/4 613/2/4
f 606/3/4 589/3/4 613/3/4
f 613/2/4 608/2/4 614/2/4
f 609/3/4 610/3/4 615/3/4
f 610/3/4 611/3/4 615/3/4
f 611/3/4 612/3/4 615/3/4
f 580/2/4 609/2/4 615/2/4
f 612/3/4 605/3/4 616/3/4
f 615/3/4 612/3/4 616/3/4
f 605/2/4 606/2/4 616/2/4
f 606/3/4 613/3/4 617/3/4
f 616/2/4 606/2/4 617/2/4
f 615/2/4 616/2/4 617/2/4
f 613/4/4 614/4/4 618/4/4
f 617/3/4 613/3/4 618/3/4
f 614/2/4 608/2/4 619/2/4
f 618/4/4 614/4/4 619/4/4
f 590/2/4 583/2/4 620/2/4
f 619/2/4 608/2/4 620/2/4
f 608/2/4 590/2/4 620/2/4
f 617/2/4 618/2/4 621/2/4
f 618/3/4 619/3/4 621/3/4
f 619/3/4 620/3/4 621/3/4
f 620/2/4 583/2/4 622/2/4
f 621/3/4 620/3/4 622/3/4
f 617/2/4 621/2/4 623/2/4
f 580/2/4 615/2/4 623/2/4
f 621/2/4 622/2/4 623/2/4
f 615/2/4 617/2/4 623/2/4
f 622/2/4 583/2/4 624/2/4
f 623/2/4 622/2/4 624/2/4
f 628/1/5 626/1/5 625/1/5
f 629/1/5 626/1/5 628/1/5
f 631/1/5 628/1/5 627/1/5
f 631/1/5 630/1/5 629/1/5
f 631/1/5 629/1/5 628/1/5
f 632/1/5 630/1/5 631/1/5
f 633/1/5 630/1/5 632/1/5
f 634/1/5 630/1/5 633/1/5
f 635/1/5 633/1/5 632/1/5
f 636/1/5 633/1/5 635/1/5
f 641/2/5 638/2/5 637/2/5
f 641/4/5 639/4/5 638/4/5
f 642/2/5 640/2/5 639/2/5
f 642/4/5 639/4/5 641/4/5
f 643/2/5 641/2/5 637/2/5
f 643/2/5 642/2/5 641/2/5
f 644/2/5 642/2/5 643/2/5
f 645/2/5 643/2/5 637/2/5
f 646/2/5 643/2/5 645/2/5
f 647/2/5 642/2/5 644/2/5
f 648/2/5 642/2/5 647/2/5
f 649/2/5 645/2/5 637/2/5
f 652/2/5 642/2/5 648/2/5
f 653/2/5 650/2/5 649/2/5
f 654/2/5 652/2/5 651/2/5
f 655/2/5 653/2/5 649/2/5
f 655/2/5 654/2/5 653/2/5
f 655/2/5 649/2/5 637/2/5
f 656/2/5 640/2/5 642/2/5
f 656/2/5 654/2/5 655/2/5
f 656/2/5 652/2/5 654/2/5
f 656/2/5 642/2/5 652/2/5
f 660/2/5 658/2/5 657/2/5
f 661/2/5 658/2/5 660/2/5
f 664/2/5 660/2/5 659/2/5
f 664/2/5 662/2/5 661/2/5
f 664/2/5 661/2/5 660/2/5
f 665/2/5 662/2/5 664/2/5
f 666/2/5 662/2/5 665/2/5
f 667/2/5 662/2/5 666/2/5
f 669/2/5 664/2/5 663/2/5
f 670/2/5 664/2/5 669/2/5
f 671/2/5 668/2/5 667/2/5
f 672/2/5 668/2/5 671/2/5
f 673/2/5 671/2/5 670/2/5
f 674/2/5 671/2/5 673/2/5
f 675/2/5 671/2/5 674/2/5
f 676/2/5 671/2/5 675/2/5
f 677/2/5 675/2/5 674/2/5
f 678/2/5 675/2/5 677/2/5
f 682/2/5 680/2/5 679/2/5
f 683/2/5 680/2/5 682/2/5
f 686/2/5 682/2/5 681/2/5
f 687/2/5 682/2/5 686/2/5
f 688/2/5 684/2/5 683/2/5
f 689/2/5 684/2/5 688/2/5
f 692/2/5 686/2/5 685/2/5
f 693/2/5 686/2/5 692/2/5
f 694/2/5 690/2/5 689/2/5
f 695/2/5 690/2/5 694/2/5
f 697/2/5 692/2/5 691/2/5
f 698/2/5 692/2/5 697/2/5
f 701/2/5 696/2/5 695/2/5
f 702/2/5 696/2/5 701/2/5
f 703/2/5 699/2/5 698/2/5
f 704/2/5 699/2/5 703/2/5
f 707/2/5 701/2/5 700/2/5
f 708/2/5 701/2/5 707/2/5
f 709/2/5 705/2/5 704/2/5
f 710/2/5 705/2/5 709/2/5
f 711/2/5 707/2/5 706/2/5
f 712/2/5 707/2/5 711/2/5
f 713/2/5 711/2/5 710/2/5
f 714/2/5 711/2/5 713/2/5
f 719/2/5 716/2/5 715/2/5
f 720/2/5 716/2/5 719/2/5
f 721/2/5 718/2/5 717/2/5
f 722/2/5 718/2/5 721/2/5
f 727/2/5 724/2/5 723/2/5
f 728/2/5 724/2/5 727/2/5
f 729/2/5 726/2/5 725/2/5
f 730/2/5 726/2/5 729/2/5
f 731/2/6 732/2/6 734/2/6
f 734/2/6 732/2/6 735/2/6
f 733/2/6 734/2/6 737/2/6
f 737/2/6 734/2/6 738/2/6
f 738/2/6 734/2/6 739/2/6
f 735/2/6 736/2/6 740/2/6
f 740/2/6 736/2/6 741/2/6
f 737/4/6 738/4/6 743/4/6
f 743/4/6 738/4/6 744/4/6
f 741/2/6 736/2/6 745/2/6
f 745/2/6 736/2/6 746/2/6
f 742/2/6 743/2/6 748/2/6
f 746/2/6 747/2/6 749/2/6
f 749/2/6 747/2/6 750/2/6
f 749/4/6 750/4/6 751/4/6
f 751/4/6 750/4/6 752/4/6
f 742/2/6 748/2/6 753/2/6
f 753/2/6 748/2/6 754/2/6
f 751/2/6 752/2/6 757/2/6
f 757/2/6 752/2/6 758/2/6
f 754/4/6 755/4/6 759/4/6
f 756/2/6 757/2/6 762/2/6
f 759/4/6 760/4/6 763/4/6
f 754/4/6 759/4/6 763/4/6
f 763/4/6 760/4/6 764/4/6
f 761/2/6 762/2/6 766/2/6
f 762/2/6 757/2/6 767/2/6
f 766/2/6 762/2/6 767/2/6
f 764/2/6 765/2/6 768/2/6
f 765/2/6 766/2/6 768/2/6
f 768/2/6 766/2/6 769/2/6
f 770/2/6 771/2/6 773/2/6
f 773/2/6 771/2/6 774/2/6
f 772/4/6 773/4/6 777/4/6
f 777/4/6 773/4/6 778/4/6
f 774/2/6 775/2/6 779/2/6
f 779/2/6 775/2/6 780/2/6
f 776/4/6 777/4/6 782/4/6
f 782/4/6 777/4/6 783/4/6
f 782/2/6 783/2/6 784/2/6
f 784/2/6 783/2/6 785/2/6
f 780/2/6 781/2/6 788/2/6
f 788/2/6 781/2/6 789/2/6
f 785/4/6 786/4/6 790/4/6
f 790/4/6 786/4/6 791/4/6
f 787/2/6 788/2/6 793/2/6
f 793/2/6 788/2/6 794/2/6
f 791/4/6 792/4/6 795/4/6
f 792/2/6 793/2/6 796/2/6
f 795/4/6 792/4/6 796/4/6
f 796/2/6 793/2/6 797/2/6
f 798/2/6 799/2/6 801/2/6
f 801/2/6 799/2/6 802/2/6
f 802/2/6 799/2/6 803/2/6
f 803/2/6 799/2/6 804/2/6
f 800/4/6 801/4/6 806/4/6
f 801/2/6 802/2/6 807/2/6
f 806/4/6 801/4/6 807/4/6
f 807/2/6 802/2/6 808/2/6
f 804/2/6 805/2/6 809/2/6
f 803/2/6 804/2/6 809/2/6
f 809/2/6 805/2/6 810/2/6
f 810/2/6 805/2/6 811/2/6
f 806/2/6 807/2/6 812/2/6
f 811/2/6 805/2/6 815/2/6
f 812/2/6 813/2/6 816/2/6
f 806/2/6 812/2/6 816/2/6
f 816/2/6 813/2/6 817/2/6
f 817/2/6 813/2/6 818/2/6
f 814/2/6 815/2/6 819/2/6
f 815/2/6 805/2/6 820/2/6
f 819/2/6 815/2/6 820/2/6
f 820/2/6 805/2/6 821/2/6
f 817/2/6 818/2/6 822/2/6
f 818/2/6 819/2/6 822/2/6
f 819/2/6 820/2/6 822/2/6
f 822/2/6 820/2/6 823/2/6
f 824/2/6 825/2/6 827/2/6
f 827/2/6 825/2/6 828/2/6
f 826/2/6 827/2/6 830/2/6
f 828/2/6 829/2/6 830/2/6
f 827/2/6 828/2/6 830/2/6
f 830/2/6 829/2/6 831/2/6
f 826/2/6 830/2/6 832/2/6
f 830/4/6 831/4/6 832/4/6
f 831/2/6 829/2/6 833/2/6
f 832/4/6 831/4/6 833/4/6
f 832/2/6 833/2/6 834/2/6
f 833/2/6 829/2/6 834/2/6
f 834/2/6 829/2/6 835/2/6
f 826/2/6 832/2/6 836/2/6
f 832/2/6 834/2/6 836/2/6
f 836/2/6 834/2/6 837/2/6
f 834/4/6 835/4/6 838/4/6
f 837/2/6 834/2/6 838/2/6
f 838/4/6 835/4/6 839/4/6
f 839/4/6 835/4/6 840/4/6
f 837/2/6 838/2/6 841/2/6
f 838/2/6 839/2/6 841/2/6
f 841/2/6 839/2/6 842/2/6
