﻿{
  "Replicas": [
    {
      "Speaker": "grandpa",
      "Text": {
        "ru": "Арни!",
        "en": "Arnie!"
      }
    },
    {
      "Speaker": "grandpa",
      "Text": {
        "ru": "Ану иди сюда, гляди какой дрын дед тебе нашел!",
        "en": "Anu come here, look what a stick your grandfa found for you!"
      }
    }
  ],
  "ChoiceOptions": [
    {
      "NextDialogue": null,
      "Condition": null,
      "Text": {
        "ru": "Плохой песик. Накажу тебя по жесткому, как ты любишь, когда вернешься...",
        "en": "Bad dog. I will punish you as tough as you like when you get back ..."
      },
      "Influence": "Grumble+=25;Pills-=5"
    }
  ]
}