# MagicaVoxel @ Ephtracy

# group
o 

# material
mtllib GoldCup.mtl
usemtl palette

# normals
vn -1 0 0
vn 1 0 0
vn 0 0 1
vn 0 0 -1
vn 0 -1 0
vn 0 1 0

# texcoords
vt 0.0996094 0.5
vt 0.103516 0.5

# verts
v -0.4 0 0.4
v -0.4 0 -0.4
v -0.4 0.1 0.4
v -0.4 0.1 -0.4
v -0.4 0.7 0.1
v -0.4 0.7 -0.1
v -0.4 0.8 0.2
v -0.4 0.8 0.1
v -0.4 0.8 -0.1
v -0.4 0.8 -0.2
v -0.4 1.3 0.2
v -0.4 1.3 0.1
v -0.4 1.3 -0.1
v -0.4 1.3 -0.2
v -0.4 1.6 0.1
v -0.4 1.6 -0.1
v -0.4 1.7 0.1
v -0.4 1.7 -0.1
v -0.3 0.6 0.1
v -0.3 0.6 -0.1
v -0.3 0.7 0.2
v -0.3 0.7 0.1
v -0.3 0.7 -0.1
v -0.3 0.7 -0.2
v -0.3 0.8 0.3
v -0.3 0.8 0.2
v -0.3 0.8 0.1
v -0.3 0.8 -0.1
v -0.3 0.8 -0.2
v -0.3 0.8 -0.3
v -0.3 1.3 0.2
v -0.3 1.3 0.1
v -0.3 1.3 -0.1
v -0.3 1.3 -0.2
v -0.3 1.5 0.3
v -0.3 1.5 0.2
v -0.3 1.5 0.1
v -0.3 1.5 -0.1
v -0.3 1.5 -0.2
v -0.3 1.5 -0.3
v -0.3 1.6 0.1
v -0.3 1.6 -0.1
v -0.3 1.7 0.2
v -0.3 1.7 0.1
v -0.3 1.7 -0.1
v -0.3 1.7 -0.2
v -0.2 0 0.2
v -0.2 0 0.1
v -0.2 0 -0.1
v -0.2 0 -0.2
v -0.2 0.1 0.2
v -0.2 0.1 0.1
v -0.2 0.1 -0.1
v -0.2 0.1 -0.2
v -0.2 0.5 0.2
v -0.2 0.5 0.1
v -0.2 0.5 -0.1
v -0.2 0.5 -0.2
v -0.2 0.6 0.1
v -0.2 0.6 -0.1
v -0.2 0.7 0.3
v -0.2 0.7 0.2
v -0.2 0.7 0.1
v -0.2 0.7 -0.1
v -0.2 0.7 -0.2
v -0.2 0.7 -0.3
v -0.2 0.8 0.4
v -0.2 0.8 0.3
v -0.2 0.8 0.2
v -0.2 0.8 -0.2
v -0.2 0.8 -0.3
v -0.2 0.8 -0.4
v -0.2 1.3 0.4
v -0.2 1.3 0.3
v -0.2 1.3 -0.3
v -0.2 1.3 -0.4
v -0.2 1.5 0.3
v -0.2 1.5 0.2
v -0.2 1.5 -0.2
v -0.2 1.5 -0.3
v -0.2 1.7 0.3
v -0.2 1.7 0.2
v -0.2 1.7 -0.2
v -0.2 1.7 -0.3
v -0.1 0 0.3
v -0.1 0 0.2
v -0.1 0 -0.2
v -0.1 0 -0.3
v -0.1 0.1 0.3
v -0.1 0.1 0.2
v -0.1 0.1 0.1
v -0.1 0.1 -0.1
v -0.1 0.1 -0.2
v -0.1 0.1 -0.3
v -0.1 0.5 0.2
v -0.1 0.5 0.1
v -0.1 0.5 -0.1
v -0.1 0.5 -0.2
v -0.1 0.6 0.3
v -0.1 0.6 0.2
v -0.1 0.6 -0.2
v -0.1 0.6 -0.3
v -0.1 0.7 0.4
v -0.1 0.7 0.3
v -0.1 0.7 0.2
v -0.1 0.7 -0.2
v -0.1 0.7 -0.3
v -0.1 0.7 -0.4
v -0.1 0.8 0.4
v -0.1 0.8 0.3
v -0.1 0.8 -0.3
v -0.1 0.8 -0.4
v -0.1 1.6 0.4
v -0.1 1.6 0.3
v -0.1 1.6 -0.3
v -0.1 1.6 -0.4
v -0.1 1.7 0.4
v -0.1 1.7 0.3
v -0.1 1.7 -0.3
v -0.1 1.7 -0.4
v 0.1 0.8 0.4
v 0.1 0.8 0.3
v 0.1 0.8 -0.3
v 0.1 0.8 -0.4
v 0.1 1.3 0.4
v 0.1 1.3 0.3
v 0.1 1.3 -0.3
v 0.1 1.3 -0.4
v 0.1 1.4 0.1
v 0.1 1.4 -0.1
v 0.1 1.5 0.3
v 0.1 1.5 0.2
v 0.1 1.5 0.1
v 0.1 1.5 -0.1
v 0.1 1.5 -0.2
v 0.1 1.5 -0.3
v 0.1 1.6 0.3
v 0.1 1.6 -0.3
v 0.1 1.7 0.3
v 0.1 1.7 0.2
v 0.1 1.7 -0.2
v 0.1 1.7 -0.3
v 0.2 1.5 0.2
v 0.2 1.5 0.1
v 0.2 1.5 -0.1
v 0.2 1.5 -0.2
v 0.2 1.7 0.2
v 0.2 1.7 0.1
v 0.2 1.7 -0.1
v 0.2 1.7 -0.2
v 0.3 0 0.3
v 0.3 0 0.1
v 0.3 0 -0.1
v 0.3 0 -0.3
v 0.3 0.1 0.3
v 0.3 0.1 0.1
v 0.3 0.1 -0.1
v 0.3 0.1 -0.3
v 0.3 1.6 0.1
v 0.3 1.6 -0.1
v 0.3 1.7 0.1
v 0.3 1.7 -0.1
v -0.3 0 0.3
v -0.3 0 0.1
v -0.3 0 -0.1
v -0.3 0 -0.3
v -0.3 0.1 0.3
v -0.3 0.1 0.1
v -0.3 0.1 -0.1
v -0.3 0.1 -0.3
v -0.3 1.6 0.1
v -0.3 1.6 -0.1
v -0.3 1.7 0.1
v -0.3 1.7 -0.1
v -0.2 1.5 0.2
v -0.2 1.5 0.1
v -0.2 1.5 -0.1
v -0.2 1.5 -0.2
v -0.2 1.7 0.2
v -0.2 1.7 0.1
v -0.2 1.7 -0.1
v -0.2 1.7 -0.2
v -0.1 0.8 0.4
v -0.1 0.8 0.3
v -0.1 0.8 -0.3
v -0.1 0.8 -0.4
v -0.1 1.3 0.4
v -0.1 1.3 0.3
v -0.1 1.3 -0.3
v -0.1 1.3 -0.4
v -0.1 1.4 0.1
v -0.1 1.4 -0.1
v -0.1 1.5 0.3
v -0.1 1.5 0.2
v -0.1 1.5 0.1
v -0.1 1.5 -0.1
v -0.1 1.5 -0.2
v -0.1 1.5 -0.3
v -0.1 1.6 0.3
v -0.1 1.6 -0.3
v -0.1 1.7 0.3
v -0.1 1.7 0.2
v -0.1 1.7 -0.2
v -0.1 1.7 -0.3
v 0.1 0 0.3
v 0.1 0 0.2
v 0.1 0 -0.2
v 0.1 0 -0.3
v 0.1 0.1 0.3
v 0.1 0.1 0.2
v 0.1 0.1 0.1
v 0.1 0.1 -0.1
v 0.1 0.1 -0.2
v 0.1 0.1 -0.3
v 0.1 0.5 0.2
v 0.1 0.5 0.1
v 0.1 0.5 -0.1
v 0.1 0.5 -0.2
v 0.1 0.6 0.3
v 0.1 0.6 0.2
v 0.1 0.6 -0.2
v 0.1 0.6 -0.3
v 0.1 0.7 0.4
v 0.1 0.7 0.3
v 0.1 0.7 0.2
v 0.1 0.7 -0.2
v 0.1 0.7 -0.3
v 0.1 0.7 -0.4
v 0.1 0.8 0.4
v 0.1 0.8 0.3
v 0.1 0.8 -0.3
v 0.1 0.8 -0.4
v 0.1 1.6 0.4
v 0.1 1.6 0.3
v 0.1 1.6 -0.3
v 0.1 1.6 -0.4
v 0.1 1.7 0.4
v 0.1 1.7 0.3
v 0.1 1.7 -0.3
v 0.1 1.7 -0.4
v 0.2 0 0.2
v 0.2 0 0.1
v 0.2 0 -0.1
v 0.2 0 -0.2
v 0.2 0.1 0.2
v 0.2 0.1 0.1
v 0.2 0.1 -0.1
v 0.2 0.1 -0.2
v 0.2 0.5 0.2
v 0.2 0.5 0.1
v 0.2 0.5 -0.1
v 0.2 0.5 -0.2
v 0.2 0.6 0.1
v 0.2 0.6 -0.1
v 0.2 0.7 0.3
v 0.2 0.7 0.2
v 0.2 0.7 0.1
v 0.2 0.7 -0.1
v 0.2 0.7 -0.2
v 0.2 0.7 -0.3
v 0.2 0.8 0.4
v 0.2 0.8 0.3
v 0.2 0.8 0.2
v 0.2 0.8 -0.2
v 0.2 0.8 -0.3
v 0.2 0.8 -0.4
v 0.2 1.3 0.4
v 0.2 1.3 0.3
v 0.2 1.3 -0.3
v 0.2 1.3 -0.4
v 0.2 1.5 0.3
v 0.2 1.5 0.2
v 0.2 1.5 -0.2
v 0.2 1.5 -0.3
v 0.2 1.7 0.3
v 0.2 1.7 0.2
v 0.2 1.7 -0.2
v 0.2 1.7 -0.3
v 0.3 0.6 0.1
v 0.3 0.6 -0.1
v 0.3 0.7 0.2
v 0.3 0.7 0.1
v 0.3 0.7 -0.1
v 0.3 0.7 -0.2
v 0.3 0.8 0.3
v 0.3 0.8 0.2
v 0.3 0.8 0.1
v 0.3 0.8 -0.1
v 0.3 0.8 -0.2
v 0.3 0.8 -0.3
v 0.3 1.3 0.2
v 0.3 1.3 0.1
v 0.3 1.3 -0.1
v 0.3 1.3 -0.2
v 0.3 1.5 0.3
v 0.3 1.5 0.2
v 0.3 1.5 0.1
v 0.3 1.5 -0.1
v 0.3 1.5 -0.2
v 0.3 1.5 -0.3
v 0.3 1.6 0.1
v 0.3 1.6 -0.1
v 0.3 1.7 0.2
v 0.3 1.7 0.1
v 0.3 1.7 -0.1
v 0.3 1.7 -0.2
v 0.4 0 0.4
v 0.4 0 -0.4
v 0.4 0.1 0.4
v 0.4 0.1 -0.4
v 0.4 0.7 0.1
v 0.4 0.7 -0.1
v 0.4 0.8 0.2
v 0.4 0.8 0.1
v 0.4 0.8 -0.1
v 0.4 0.8 -0.2
v 0.4 1.3 0.2
v 0.4 1.3 0.1
v 0.4 1.3 -0.1
v 0.4 1.3 -0.2
v 0.4 1.6 0.1
v 0.4 1.6 -0.1
v 0.4 1.7 0.1
v 0.4 1.7 -0.1
v -0.4 0 0.4
v -0.4 0.1 0.4
v -0.2 0.8 0.4
v -0.2 1.3 0.4
v -0.1 0.7 0.4
v -0.1 0.8 0.4
v -0.1 1.3 0.4
v -0.1 1.6 0.4
v -0.1 1.7 0.4
v 0.1 0.7 0.4
v 0.1 0.8 0.4
v 0.1 1.3 0.4
v 0.1 1.6 0.4
v 0.1 1.7 0.4
v 0.2 0.8 0.4
v 0.2 1.3 0.4
v 0.4 0 0.4
v 0.4 0.1 0.4
v -0.3 0.8 0.3
v -0.3 1.5 0.3
v -0.2 0.7 0.3
v -0.2 0.8 0.3
v -0.2 1.3 0.3
v -0.2 1.5 0.3
v -0.2 1.7 0.3
v -0.1 0.6 0.3
v -0.1 0.7 0.3
v -0.1 0.8 0.3
v -0.1 1.3 0.3
v -0.1 1.5 0.3
v -0.1 1.6 0.3
v -0.1 1.7 0.3
v 0.1 0.6 0.3
v 0.1 0.7 0.3
v 0.1 0.8 0.3
v 0.1 1.3 0.3
v 0.1 1.5 0.3
v 0.1 1.6 0.3
v 0.1 1.7 0.3
v 0.2 0.7 0.3
v 0.2 0.8 0.3
v 0.2 1.3 0.3
v 0.2 1.5 0.3
v 0.2 1.7 0.3
v 0.3 0.8 0.3
v 0.3 1.5 0.3
v -0.4 0.8 0.2
v -0.4 1.3 0.2
v -0.3 0.7 0.2
v -0.3 0.8 0.2
v -0.3 1.3 0.2
v -0.3 1.5 0.2
v -0.3 1.7 0.2
v -0.2 0 0.2
v -0.2 0.1 0.2
v -0.2 0.5 0.2
v -0.2 0.7 0.2
v -0.2 0.8 0.2
v -0.2 1.5 0.2
v -0.2 1.7 0.2
v -0.1 0 0.2
v -0.1 0.1 0.2
v -0.1 0.5 0.2
v -0.1 0.6 0.2
v -0.1 0.7 0.2
v 0.1 0 0.2
v 0.1 0.1 0.2
v 0.1 0.5 0.2
v 0.1 0.6 0.2
v 0.1 0.7 0.2
v 0.2 0 0.2
v 0.2 0.1 0.2
v 0.2 0.5 0.2
v 0.2 0.7 0.2
v 0.2 0.8 0.2
v 0.2 1.5 0.2
v 0.2 1.7 0.2
v 0.3 0.7 0.2
v 0.3 0.8 0.2
v 0.3 1.3 0.2
v 0.3 1.5 0.2
v 0.3 1.7 0.2
v 0.4 0.8 0.2
v 0.4 1.3 0.2
v -0.4 0.7 0.1
v -0.4 0.8 0.1
v -0.4 1.6 0.1
v -0.4 1.7 0.1
v -0.3 0 0.1
v -0.3 0.1 0.1
v -0.3 0.6 0.1
v -0.3 0.7 0.1
v -0.3 0.8 0.1
v -0.3 1.6 0.1
v -0.3 1.7 0.1
v -0.2 0 0.1
v -0.2 0.1 0.1
v -0.2 0.5 0.1
v -0.2 0.6 0.1
v -0.2 0.7 0.1
v -0.1 0.1 0.1
v -0.1 0.5 0.1
v 0.1 0.1 0.1
v 0.1 0.5 0.1
v 0.2 0 0.1
v 0.2 0.1 0.1
v 0.2 0.5 0.1
v 0.2 0.6 0.1
v 0.2 0.7 0.1
v 0.3 0 0.1
v 0.3 0.1 0.1
v 0.3 0.6 0.1
v 0.3 0.7 0.1
v 0.3 0.8 0.1
v 0.3 1.6 0.1
v 0.3 1.7 0.1
v 0.4 0.7 0.1
v 0.4 0.8 0.1
v 0.4 1.6 0.1
v 0.4 1.7 0.1
v -0.4 0.8 -0.1
v -0.4 1.3 -0.1
v -0.3 0.8 -0.1
v -0.3 1.3 -0.1
v -0.3 1.5 -0.1
v -0.3 1.6 -0.1
v -0.3 1.7 -0.1
v -0.2 1.5 -0.1
v -0.2 1.7 -0.1
v -0.1 1.4 -0.1
v -0.1 1.5 -0.1
v 0.1 1.4 -0.1
v 0.1 1.5 -0.1
v 0.2 1.5 -0.1
v 0.2 1.7 -0.1
v 0.3 0.8 -0.1
v 0.3 1.3 -0.1
v 0.3 1.5 -0.1
v 0.3 1.6 -0.1
v 0.3 1.7 -0.1
v 0.4 0.8 -0.1
v 0.4 1.3 -0.1
v -0.2 1.5 -0.2
v -0.2 1.7 -0.2
v -0.1 1.5 -0.2
v -0.1 1.7 -0.2
v 0.1 1.5 -0.2
v 0.1 1.7 -0.2
v 0.2 1.5 -0.2
v 0.2 1.7 -0.2
v -0.3 0 -0.3
v -0.3 0.1 -0.3
v -0.1 0 -0.3
v -0.1 0.1 -0.3
v -0.1 1.6 -0.3
v -0.1 1.7 -0.3
v 0.1 0 -0.3
v 0.1 0.1 -0.3
v 0.1 1.6 -0.3
v 0.1 1.7 -0.3
v 0.3 0 -0.3
v 0.3 0.1 -0.3
v -0.3 0 0.3
v -0.3 0.1 0.3
v -0.1 0 0.3
v -0.1 0.1 0.3
v -0.1 1.6 0.3
v -0.1 1.7 0.3
v 0.1 0 0.3
v 0.1 0.1 0.3
v 0.1 1.6 0.3
v 0.1 1.7 0.3
v 0.3 0 0.3
v 0.3 0.1 0.3
v -0.2 1.5 0.2
v -0.2 1.7 0.2
v -0.1 1.5 0.2
v -0.1 1.7 0.2
v 0.1 1.5 0.2
v 0.1 1.7 0.2
v 0.2 1.5 0.2
v 0.2 1.7 0.2
v -0.4 0.8 0.1
v -0.4 1.3 0.1
v -0.3 0.8 0.1
v -0.3 1.3 0.1
v -0.3 1.5 0.1
v -0.3 1.6 0.1
v -0.3 1.7 0.1
v -0.2 1.5 0.1
v -0.2 1.7 0.1
v -0.1 1.4 0.1
v -0.1 1.5 0.1
v 0.1 1.4 0.1
v 0.1 1.5 0.1
v 0.2 1.5 0.1
v 0.2 1.7 0.1
v 0.3 0.8 0.1
v 0.3 1.3 0.1
v 0.3 1.5 0.1
v 0.3 1.6 0.1
v 0.3 1.7 0.1
v 0.4 0.8 0.1
v 0.4 1.3 0.1
v -0.4 0.7 -0.1
v -0.4 0.8 -0.1
v -0.4 1.6 -0.1
v -0.4 1.7 -0.1
v -0.3 0 -0.1
v -0.3 0.1 -0.1
v -0.3 0.6 -0.1
v -0.3 0.7 -0.1
v -0.3 0.8 -0.1
v -0.3 1.6 -0.1
v -0.3 1.7 -0.1
v -0.2 0 -0.1
v -0.2 0.1 -0.1
v -0.2 0.5 -0.1
v -0.2 0.6 -0.1
v -0.2 0.7 -0.1
v -0.1 0.1 -0.1
v -0.1 0.5 -0.1
v 0.1 0.1 -0.1
v 0.1 0.5 -0.1
v 0.2 0 -0.1
v 0.2 0.1 -0.1
v 0.2 0.5 -0.1
v 0.2 0.6 -0.1
v 0.2 0.7 -0.1
v 0.3 0 -0.1
v 0.3 0.1 -0.1
v 0.3 0.6 -0.1
v 0.3 0.7 -0.1
v 0.3 0.8 -0.1
v 0.3 1.6 -0.1
v 0.3 1.7 -0.1
v 0.4 0.7 -0.1
v 0.4 0.8 -0.1
v 0.4 1.6 -0.1
v 0.4 1.7 -0.1
v -0.4 0.8 -0.2
v -0.4 1.3 -0.2
v -0.3 0.7 -0.2
v -0.3 0.8 -0.2
v -0.3 1.3 -0.2
v -0.3 1.5 -0.2
v -0.3 1.7 -0.2
v -0.2 0 -0.2
v -0.2 0.1 -0.2
v -0.2 0.5 -0.2
v -0.2 0.7 -0.2
v -0.2 0.8 -0.2
v -0.2 1.5 -0.2
v -0.2 1.7 -0.2
v -0.1 0 -0.2
v -0.1 0.1 -0.2
v -0.1 0.5 -0.2
v -0.1 0.6 -0.2
v -0.1 0.7 -0.2
v 0.1 0 -0.2
v 0.1 0.1 -0.2
v 0.1 0.5 -0.2
v 0.1 0.6 -0.2
v 0.1 0.7 -0.2
v 0.2 0 -0.2
v 0.2 0.1 -0.2
v 0.2 0.5 -0.2
v 0.2 0.7 -0.2
v 0.2 0.8 -0.2
v 0.2 1.5 -0.2
v 0.2 1.7 -0.2
v 0.3 0.7 -0.2
v 0.3 0.8 -0.2
v 0.3 1.3 -0.2
v 0.3 1.5 -0.2
v 0.3 1.7 -0.2
v 0.4 0.8 -0.2
v 0.4 1.3 -0.2
v -0.3 0.8 -0.3
v -0.3 1.5 -0.3
v -0.2 0.7 -0.3
v -0.2 0.8 -0.3
v -0.2 1.3 -0.3
v -0.2 1.5 -0.3
v -0.2 1.7 -0.3
v -0.1 0.6 -0.3
v -0.1 0.7 -0.3
v -0.1 0.8 -0.3
v -0.1 1.3 -0.3
v -0.1 1.5 -0.3
v -0.1 1.6 -0.3
v -0.1 1.7 -0.3
v 0.1 0.6 -0.3
v 0.1 0.7 -0.3
v 0.1 0.8 -0.3
v 0.1 1.3 -0.3
v 0.1 1.5 -0.3
v 0.1 1.6 -0.3
v 0.1 1.7 -0.3
v 0.2 0.7 -0.3
v 0.2 0.8 -0.3
v 0.2 1.3 -0.3
v 0.2 1.5 -0.3
v 0.2 1.7 -0.3
v 0.3 0.8 -0.3
v 0.3 1.5 -0.3
v -0.4 0 -0.4
v -0.4 0.1 -0.4
v -0.2 0.8 -0.4
v -0.2 1.3 -0.4
v -0.1 0.7 -0.4
v -0.1 0.8 -0.4
v -0.1 1.3 -0.4
v -0.1 1.6 -0.4
v -0.1 1.7 -0.4
v 0.1 0.7 -0.4
v 0.1 0.8 -0.4
v 0.1 1.3 -0.4
v 0.1 1.6 -0.4
v 0.1 1.7 -0.4
v 0.2 0.8 -0.4
v 0.2 1.3 -0.4
v 0.4 0 -0.4
v 0.4 0.1 -0.4
v -0.4 0 0.4
v 0.4 0 0.4
v -0.3 0 0.3
v -0.1 0 0.3
v 0.1 0 0.3
v 0.3 0 0.3
v -0.2 0 0.2
v -0.1 0 0.2
v 0.1 0 0.2
v 0.2 0 0.2
v -0.3 0 0.1
v -0.2 0 0.1
v -0.1 0 0.1
v 0.1 0 0.1
v 0.2 0 0.1
v 0.3 0 0.1
v -0.3 0 -0.1
v -0.2 0 -0.1
v -0.1 0 -0.1
v 0.1 0 -0.1
v 0.2 0 -0.1
v 0.3 0 -0.1
v -0.2 0 -0.2
v -0.1 0 -0.2
v 0.1 0 -0.2
v 0.2 0 -0.2
v -0.3 0 -0.3
v -0.1 0 -0.3
v 0.1 0 -0.3
v 0.3 0 -0.3
v -0.4 0 -0.4
v 0.4 0 -0.4
v -0.2 0.5 0.2
v -0.1 0.5 0.2
v 0.1 0.5 0.2
v 0.2 0.5 0.2
v -0.2 0.5 0.1
v -0.1 0.5 0.1
v 0.1 0.5 0.1
v 0.2 0.5 0.1
v -0.2 0.5 -0.1
v -0.1 0.5 -0.1
v 0.1 0.5 -0.1
v 0.2 0.5 -0.1
v -0.2 0.5 -0.2
v -0.1 0.5 -0.2
v 0.1 0.5 -0.2
v 0.2 0.5 -0.2
v -0.1 0.6 0.3
v 0.1 0.6 0.3
v -0.1 0.6 0.2
v 0.1 0.6 0.2
v -0.3 0.6 0.1
v -0.2 0.6 0.1
v 0.2 0.6 0.1
v 0.3 0.6 0.1
v -0.3 0.6 -0.1
v -0.2 0.6 -0.1
v 0.2 0.6 -0.1
v 0.3 0.6 -0.1
v -0.1 0.6 -0.2
v 0.1 0.6 -0.2
v -0.1 0.6 -0.3
v 0.1 0.6 -0.3
v -0.1 0.7 0.4
v 0.1 0.7 0.4
v -0.2 0.7 0.3
v -0.1 0.7 0.3
v 0.1 0.7 0.3
v 0.2 0.7 0.3
v -0.3 0.7 0.2
v -0.2 0.7 0.2
v -0.1 0.7 0.2
v 0.1 0.7 0.2
v 0.2 0.7 0.2
v 0.3 0.7 0.2
v -0.4 0.7 0.1
v -0.3 0.7 0.1
v -0.2 0.7 0.1
v 0.2 0.7 0.1
v 0.3 0.7 0.1
v 0.4 0.7 0.1
v -0.4 0.7 -0.1
v -0.3 0.7 -0.1
v -0.2 0.7 -0.1
v 0.2 0.7 -0.1
v 0.3 0.7 -0.1
v 0.4 0.7 -0.1
v -0.3 0.7 -0.2
v -0.2 0.7 -0.2
v -0.1 0.7 -0.2
v 0.1 0.7 -0.2
v 0.2 0.7 -0.2
v 0.3 0.7 -0.2
v -0.2 0.7 -0.3
v -0.1 0.7 -0.3
v 0.1 0.7 -0.3
v 0.2 0.7 -0.3
v -0.1 0.7 -0.4
v 0.1 0.7 -0.4
v -0.2 0.8 0.4
v -0.1 0.8 0.4
v 0.1 0.8 0.4
v 0.2 0.8 0.4
v -0.3 0.8 0.3
v -0.2 0.8 0.3
v -0.1 0.8 0.3
v 0.1 0.8 0.3
v 0.2 0.8 0.3
v 0.3 0.8 0.3
v -0.4 0.8 0.2
v -0.3 0.8 0.2
v -0.2 0.8 0.2
v 0.2 0.8 0.2
v 0.3 0.8 0.2
v 0.4 0.8 0.2
v -0.4 0.8 0.1
v -0.3 0.8 0.1
v 0.3 0.8 0.1
v 0.4 0.8 0.1
v -0.4 0.8 -0.1
v -0.3 0.8 -0.1
v 0.3 0.8 -0.1
v 0.4 0.8 -0.1
v -0.4 0.8 -0.2
v -0.3 0.8 -0.2
v -0.2 0.8 -0.2
v 0.2 0.8 -0.2
v 0.3 0.8 -0.2
v 0.4 0.8 -0.2
v -0.3 0.8 -0.3
v -0.2 0.8 -0.3
v -0.1 0.8 -0.3
v 0.1 0.8 -0.3
v 0.2 0.8 -0.3
v 0.3 0.8 -0.3
v -0.2 0.8 -0.4
v -0.1 0.8 -0.4
v 0.1 0.8 -0.4
v 0.2 0.8 -0.4
v -0.1 1.6 0.4
v 0.1 1.6 0.4
v -0.1 1.6 0.3
v 0.1 1.6 0.3
v -0.4 1.6 0.1
v -0.3 1.6 0.1
v 0.3 1.6 0.1
v 0.4 1.6 0.1
v -0.4 1.6 -0.1
v -0.3 1.6 -0.1
v 0.3 1.6 -0.1
v 0.4 1.6 -0.1
v -0.1 1.6 -0.3
v 0.1 1.6 -0.3
v -0.1 1.6 -0.4
v 0.1 1.6 -0.4
v -0.4 0.1 0.4
v 0.4 0.1 0.4
v -0.3 0.1 0.3
v -0.1 0.1 0.3
v 0.1 0.1 0.3
v 0.3 0.1 0.3
v -0.2 0.1 0.2
v -0.1 0.1 0.2
v 0.1 0.1 0.2
v 0.2 0.1 0.2
v -0.3 0.1 0.1
v -0.2 0.1 0.1
v -0.1 0.1 0.1
v 0.1 0.1 0.1
v 0.2 0.1 0.1
v 0.3 0.1 0.1
v -0.3 0.1 -0.1
v -0.2 0.1 -0.1
v -0.1 0.1 -0.1
v 0.1 0.1 -0.1
v 0.2 0.1 -0.1
v 0.3 0.1 -0.1
v -0.2 0.1 -0.2
v -0.1 0.1 -0.2
v 0.1 0.1 -0.2
v 0.2 0.1 -0.2
v -0.3 0.1 -0.3
v -0.1 0.1 -0.3
v 0.1 0.1 -0.3
v 0.3 0.1 -0.3
v -0.4 0.1 -0.4
v 0.4 0.1 -0.4
v -0.1 0.8 0.4
v 0.1 0.8 0.4
v -0.1 0.8 0.3
v 0.1 0.8 0.3
v -0.4 0.8 0.1
v -0.3 0.8 0.1
v 0.3 0.8 0.1
v 0.4 0.8 0.1
v -0.4 0.8 -0.1
v -0.3 0.8 -0.1
v 0.3 0.8 -0.1
v 0.4 0.8 -0.1
v -0.1 0.8 -0.3
v 0.1 0.8 -0.3
v -0.1 0.8 -0.4
v 0.1 0.8 -0.4
v -0.2 1.3 0.4
v -0.1 1.3 0.4
v 0.1 1.3 0.4
v 0.2 1.3 0.4
v -0.2 1.3 0.3
v -0.1 1.3 0.3
v 0.1 1.3 0.3
v 0.2 1.3 0.3
v -0.4 1.3 0.2
v -0.3 1.3 0.2
v 0.3 1.3 0.2
v 0.4 1.3 0.2
v -0.4 1.3 0.1
v -0.3 1.3 0.1
v 0.3 1.3 0.1
v 0.4 1.3 0.1
v -0.4 1.3 -0.1
v -0.3 1.3 -0.1
v 0.3 1.3 -0.1
v 0.4 1.3 -0.1
v -0.4 1.3 -0.2
v -0.3 1.3 -0.2
v 0.3 1.3 -0.2
v 0.4 1.3 -0.2
v -0.2 1.3 -0.3
v -0.1 1.3 -0.3
v 0.1 1.3 -0.3
v 0.2 1.3 -0.3
v -0.2 1.3 -0.4
v -0.1 1.3 -0.4
v 0.1 1.3 -0.4
v 0.2 1.3 -0.4
v -0.1 1.4 0.1
v 0.1 1.4 0.1
v -0.1 1.4 -0.1
v 0.1 1.4 -0.1
v -0.3 1.5 0.3
v -0.2 1.5 0.3
v -0.1 1.5 0.3
v 0.1 1.5 0.3
v 0.2 1.5 0.3
v 0.3 1.5 0.3
v -0.3 1.5 0.2
v -0.2 1.5 0.2
v -0.1 1.5 0.2
v 0.1 1.5 0.2
v 0.2 1.5 0.2
v 0.3 1.5 0.2
v -0.3 1.5 0.1
v -0.2 1.5 0.1
v -0.1 1.5 0.1
v 0.1 1.5 0.1
v 0.2 1.5 0.1
v 0.3 1.5 0.1
v -0.3 1.5 -0.1
v -0.2 1.5 -0.1
v -0.1 1.5 -0.1
v 0.1 1.5 -0.1
v 0.2 1.5 -0.1
v 0.3 1.5 -0.1
v -0.3 1.5 -0.2
v -0.2 1.5 -0.2
v -0.1 1.5 -0.2
v 0.1 1.5 -0.2
v 0.2 1.5 -0.2
v 0.3 1.5 -0.2
v -0.3 1.5 -0.3
v -0.2 1.5 -0.3
v -0.1 1.5 -0.3
v 0.1 1.5 -0.3
v 0.2 1.5 -0.3
v 0.3 1.5 -0.3
v -0.1 1.7 0.4
v 0.1 1.7 0.4
v -0.2 1.7 0.3
v -0.1 1.7 0.3
v 0.1 1.7 0.3
v 0.2 1.7 0.3
v -0.3 1.7 0.2
v -0.2 1.7 0.2
v -0.1 1.7 0.2
v 0.1 1.7 0.2
v 0.2 1.7 0.2
v 0.3 1.7 0.2
v -0.4 1.7 0.1
v -0.3 1.7 0.1
v -0.2 1.7 0.1
v 0.2 1.7 0.1
v 0.3 1.7 0.1
v 0.4 1.7 0.1
v -0.4 1.7 -0.1
v -0.3 1.7 -0.1
v -0.2 1.7 -0.1
v 0.2 1.7 -0.1
v 0.3 1.7 -0.1
v 0.4 1.7 -0.1
v -0.3 1.7 -0.2
v -0.2 1.7 -0.2
v -0.1 1.7 -0.2
v 0.1 1.7 -0.2
v 0.2 1.7 -0.2
v 0.3 1.7 -0.2
v -0.2 1.7 -0.3
v -0.1 1.7 -0.3
v 0.1 1.7 -0.3
v 0.2 1.7 -0.3
v -0.1 1.7 -0.4
v 0.1 1.7 -0.4

# faces
f 3/2/1 2/2/1 1/2/1
f 4/2/1 2/2/1 3/2/1
f 8/2/1 6/2/1 5/2/1
f 9/2/1 6/2/1 8/2/1
f 11/2/1 8/2/1 7/2/1
f 12/2/1 8/2/1 11/2/1
f 13/2/1 10/2/1 9/2/1
f 14/2/1 10/2/1 13/2/1
f 17/2/1 16/2/1 15/2/1
f 18/2/1 16/2/1 17/2/1
f 22/1/1 20/1/1 19/1/1
f 23/1/1 20/1/1 22/1/1
f 26/1/1 22/1/1 21/1/1
f 27/1/1 22/1/1 26/1/1
f 28/1/1 24/1/1 23/1/1
f 29/1/1 24/1/1 28/1/1
f 31/1/1 26/1/1 25/1/1
f 32/1/1 28/1/1 27/1/1
f 33/1/1 28/1/1 32/1/1
f 34/1/1 30/1/1 29/1/1
f 35/1/1 33/1/1 32/1/1
f 35/1/1 34/1/1 33/1/1
f 35/1/1 31/1/1 25/1/1
f 35/1/1 32/1/1 31/1/1
f 36/1/1 34/1/1 35/1/1
f 37/1/1 34/1/1 36/1/1
f 38/1/1 34/1/1 37/1/1
f 39/1/1 30/1/1 34/1/1
f 39/1/1 34/1/1 38/1/1
f 40/1/1 30/1/1 39/1/1
f 41/2/1 37/2/1 36/2/1
f 42/2/1 39/2/1 38/2/1
f 43/2/1 41/2/1 36/2/1
f 44/2/1 41/2/1 43/2/1
f 45/2/1 39/2/1 42/2/1
f 46/2/1 39/2/1 45/2/1
f 51/1/1 48/1/1 47/1/1
f 52/1/1 48/1/1 51/1/1
f 53/1/1 50/1/1 49/1/1
f 54/1/1 50/1/1 53/1/1
f 56/1/1 53/1/1 52/1/1
f 57/1/1 53/1/1 56/1/1
f 59/1/1 56/1/1 55/1/1
f 59/1/1 58/1/1 57/1/1
f 59/1/1 57/1/1 56/1/1
f 60/1/1 58/1/1 59/1/1
f 62/1/1 59/1/1 55/1/1
f 63/1/1 59/1/1 62/1/1
f 64/1/1 58/1/1 60/1/1
f 65/1/1 58/1/1 64/1/1
f 68/1/1 62/1/1 61/1/1
f 69/1/1 62/1/1 68/1/1
f 70/1/1 66/1/1 65/1/1
f 71/1/1 66/1/1 70/1/1
f 73/2/1 68/2/1 67/2/1
f 74/2/1 68/2/1 73/2/1
f 75/2/1 72/2/1 71/2/1
f 76/2/1 72/2/1 75/2/1
f 81/2/1 78/2/1 77/2/1
f 82/2/1 78/2/1 81/2/1
f 83/2/1 80/2/1 79/2/1
f 84/2/1 80/2/1 83/2/1
f 89/2/1 86/2/1 85/2/1
f 90/2/1 86/2/1 89/2/1
f 93/2/1 88/2/1 87/2/1
f 94/2/1 88/2/1 93/2/1
f 95/1/1 91/1/1 90/1/1
f 96/1/1 91/1/1 95/1/1
f 97/1/1 93/1/1 92/1/1
f 98/1/1 93/1/1 97/1/1
f 104/1/1 100/1/1 99/1/1
f 105/1/1 100/1/1 104/1/1
f 106/1/1 102/1/1 101/1/1
f 107/1/1 102/1/1 106/1/1
f 109/2/1 104/2/1 103/2/1
f 110/2/1 104/2/1 109/2/1
f 111/2/1 108/2/1 107/2/1
f 112/2/1 108/2/1 111/2/1
f 117/2/1 114/2/1 113/2/1
f 118/2/1 114/2/1 117/2/1
f 119/2/1 116/2/1 115/2/1
f 120/2/1 116/2/1 119/2/1
f 125/2/1 122/2/1 121/2/1
f 126/2/1 122/2/1 125/2/1
f 127/2/1 124/2/1 123/2/1
f 128/2/1 124/2/1 127/2/1
f 133/1/1 130/1/1 129/1/1
f 134/1/1 130/1/1 133/1/1
f 137/2/1 132/2/1 131/2/1
f 138/2/1 136/2/1 135/2/1
f 139/2/1 132/2/1 137/2/1
f 140/2/1 132/2/1 139/2/1
f 141/2/1 138/2/1 135/2/1
f 142/2/1 138/2/1 141/2/1
f 147/2/1 144/2/1 143/2/1
f 148/2/1 144/2/1 147/2/1
f 149/2/1 146/2/1 145/2/1
f 150/2/1 146/2/1 149/2/1
f 155/2/1 152/2/1 151/2/1
f 156/2/1 152/2/1 155/2/1
f 157/2/1 154/2/1 153/2/1
f 158/2/1 154/2/1 157/2/1
f 161/2/1 160/2/1 159/2/1
f 162/2/1 160/2/1 161/2/1
f 163/2/2 164/2/2 167/2/2
f 167/2/2 164/2/2 168/2/2
f 165/2/2 166/2/2 169/2/2
f 169/2/2 166/2/2 170/2/2
f 171/2/2 172/2/2 173/2/2
f 173/2/2 172/2/2 174/2/2
f 175/2/2 176/2/2 179/2/2
f 179/2/2 176/2/2 180/2/2
f 177/2/2 178/2/2 181/2/2
f 181/2/2 178/2/2 182/2/2
f 183/2/2 184/2/2 187/2/2
f 187/2/2 184/2/2 188/2/2
f 185/2/2 186/2/2 189/2/2
f 189/2/2 186/2/2 190/2/2
f 191/1/2 192/1/2 195/1/2
f 195/1/2 192/1/2 196/1/2
f 193/2/2 194/2/2 199/2/2
f 197/2/2 198/2/2 200/2/2
f 199/2/2 194/2/2 201/2/2
f 201/2/2 194/2/2 202/2/2
f 197/2/2 200/2/2 203/2/2
f 203/2/2 200/2/2 204/2/2
f 205/2/2 206/2/2 209/2/2
f 209/2/2 206/2/2 210/2/2
f 207/2/2 208/2/2 213/2/2
f 213/2/2 208/2/2 214/2/2
f 210/1/2 211/1/2 215/1/2
f 215/1/2 211/1/2 216/1/2
f 212/1/2 213/1/2 217/1/2
f 217/1/2 213/1/2 218/1/2
f 219/1/2 220/1/2 224/1/2
f 224/1/2 220/1/2 225/1/2
f 221/1/2 222/1/2 226/1/2
f 226/1/2 222/1/2 227/1/2
f 223/2/2 224/2/2 229/2/2
f 229/2/2 224/2/2 230/2/2
f 227/2/2 228/2/2 231/2/2
f 231/2/2 228/2/2 232/2/2
f 233/2/2 234/2/2 237/2/2
f 237/2/2 234/2/2 238/2/2
f 235/2/2 236/2/2 239/2/2
f 239/2/2 236/2/2 240/2/2
f 241/1/2 242/1/2 245/1/2
f 245/1/2 242/1/2 246/1/2
f 243/1/2 244/1/2 247/1/2
f 247/1/2 244/1/2 248/1/2
f 246/1/2 247/1/2 250/1/2
f 250/1/2 247/1/2 251/1/2
f 249/1/2 250/1/2 253/1/2
f 251/1/2 252/1/2 253/1/2
f 250/1/2 251/1/2 253/1/2
f 253/1/2 252/1/2 254/1/2
f 249/1/2 253/1/2 256/1/2
f 256/1/2 253/1/2 257/1/2
f 254/1/2 252/1/2 258/1/2
f 258/1/2 252/1/2 259/1/2
f 255/1/2 256/1/2 262/1/2
f 262/1/2 256/1/2 263/1/2
f 259/1/2 260/1/2 264/1/2
f 264/1/2 260/1/2 265/1/2
f 261/2/2 262/2/2 267/2/2
f 267/2/2 262/2/2 268/2/2
f 265/2/2 266/2/2 269/2/2
f 269/2/2 266/2/2 270/2/2
f 271/2/2 272/2/2 275/2/2
f 275/2/2 272/2/2 276/2/2
f 273/2/2 274/2/2 277/2/2
f 277/2/2 274/2/2 278/2/2
f 279/1/2 280/1/2 282/1/2
f 282/1/2 280/1/2 283/1/2
f 281/1/2 282/1/2 286/1/2
f 286/1/2 282/1/2 287/1/2
f 283/1/2 284/1/2 288/1/2
f 288/1/2 284/1/2 289/1/2
f 285/1/2 286/1/2 291/1/2
f 287/1/2 288/1/2 292/1/2
f 292/1/2 288/1/2 293/1/2
f 289/1/2 290/1/2 294/1/2
f 292/1/2 293/1/2 295/1/2
f 293/1/2 294/1/2 295/1/2
f 285/1/2 291/1/2 295/1/2
f 291/1/2 292/1/2 295/1/2
f 295/1/2 294/1/2 296/1/2
f 296/1/2 294/1/2 297/1/2
f 297/1/2 294/1/2 298/1/2
f 294/1/2 290/1/2 299/1/2
f 298/1/2 294/1/2 299/1/2
f 299/1/2 290/1/2 300/1/2
f 296/2/2 297/2/2 301/2/2
f 298/2/2 299/2/2 302/2/2
f 296/2/2 301/2/2 303/2/2
f 303/2/2 301/2/2 304/2/2
f 302/2/2 299/2/2 305/2/2
f 305/2/2 299/2/2 306/2/2
f 307/2/2 308/2/2 309/2/2
f 309/2/2 308/2/2 310/2/2
f 311/2/2 312/2/2 314/2/2
f 314/2/2 312/2/2 315/2/2
f 313/2/2 314/2/2 317/2/2
f 317/2/2 314/2/2 318/2/2
f 315/2/2 316/2/2 319/2/2
f 319/2/2 316/2/2 320/2/2
f 321/2/2 322/2/2 323/2/2
f 323/2/2 322/2/2 324/2/2
f 330/2/3 328/2/3 327/2/3
f 331/2/3 328/2/3 330/2/3
f 334/2/3 330/2/3 329/2/3
f 335/2/3 330/2/3 334/2/3
f 337/2/3 333/2/3 332/2/3
f 338/2/3 333/2/3 337/2/3
f 339/2/3 336/2/3 335/2/3
f 340/2/3 336/2/3 339/2/3
f 341/2/3 326/2/3 325/2/3
f 342/2/3 326/2/3 341/2/3
f 346/1/3 344/1/3 343/1/3
f 347/1/3 344/1/3 346/1/3
f 348/1/3 344/1/3 347/1/3
f 351/1/3 346/1/3 345/1/3
f 352/1/3 346/1/3 351/1/3
f 353/1/3 348/1/3 347/1/3
f 354/2/3 349/2/3 348/2/3
f 354/1/3 348/1/3 353/1/3
f 355/2/3 349/2/3 354/2/3
f 356/2/3 349/2/3 355/2/3
f 357/1/3 351/1/3 350/1/3
f 358/1/3 351/1/3 357/1/3
f 359/1/3 353/1/3 352/1/3
f 359/1/3 354/1/3 353/1/3
f 360/1/3 354/1/3 359/1/3
f 361/1/3 354/1/3 360/1/3
f 364/1/3 359/1/3 358/1/3
f 365/1/3 359/1/3 364/1/3
f 366/1/3 361/1/3 360/1/3
f 367/2/3 363/2/3 362/2/3
f 367/2/3 362/2/3 361/2/3
f 367/1/3 361/1/3 366/1/3
f 368/2/3 363/2/3 367/2/3
f 369/1/3 366/1/3 365/1/3
f 369/1/3 367/1/3 366/1/3
f 370/1/3 367/1/3 369/1/3
f 374/2/3 372/2/3 371/2/3
f 375/2/3 372/2/3 374/2/3
f 381/1/3 374/1/3 373/1/3
f 382/1/3 374/1/3 381/1/3
f 383/2/3 377/2/3 376/2/3
f 384/2/3 377/2/3 383/2/3
f 385/1/3 379/1/3 378/1/3
f 386/1/3 379/1/3 385/1/3
f 387/1/3 381/1/3 380/1/3
f 388/1/3 381/1/3 387/1/3
f 389/1/3 381/1/3 388/1/3
f 391/1/3 387/1/3 386/1/3
f 391/1/3 388/1/3 387/1/3
f 392/1/3 388/1/3 391/1/3
f 393/1/3 388/1/3 392/1/3
f 395/1/3 391/1/3 390/1/3
f 396/1/3 391/1/3 395/1/3
f 397/1/3 394/1/3 393/1/3
f 397/1/3 393/1/3 392/1/3
f 398/1/3 394/1/3 397/1/3
f 402/1/3 399/1/3 398/1/3
f 403/1/3 399/1/3 402/1/3
f 405/2/3 401/2/3 400/2/3
f 406/2/3 401/2/3 405/2/3
f 407/2/3 404/2/3 403/2/3
f 408/2/3 404/2/3 407/2/3
f 416/2/3 410/2/3 409/2/3
f 417/2/3 410/2/3 416/2/3
f 418/2/3 412/2/3 411/2/3
f 419/2/3 412/2/3 418/2/3
f 420/2/3 414/2/3 413/2/3
f 421/2/3 414/2/3 420/2/3
f 423/1/3 416/1/3 415/1/3
f 424/1/3 416/1/3 423/1/3
f 425/1/3 422/1/3 421/1/3
f 426/1/3 422/1/3 425/1/3
f 430/1/3 428/1/3 427/1/3
f 431/1/3 428/1/3 430/1/3
f 434/2/3 430/2/3 429/2/3
f 435/2/3 430/2/3 434/2/3
f 436/1/3 433/1/3 432/1/3
f 437/1/3 433/1/3 436/1/3
f 441/2/3 438/2/3 437/2/3
f 442/2/3 438/2/3 441/2/3
f 443/2/3 440/2/3 439/2/3
f 444/2/3 440/2/3 443/2/3
f 447/2/3 446/2/3 445/2/3
f 448/2/3 446/2/3 447/2/3
f 452/2/3 451/2/3 450/2/3
f 452/2/3 450/2/3 449/2/3
f 453/2/3 451/2/3 452/2/3
f 456/1/3 455/1/3 454/1/3
f 457/1/3 455/1/3 456/1/3
f 462/2/3 459/2/3 458/2/3
f 463/2/3 459/2/3 462/2/3
f 464/2/3 459/2/3 463/2/3
f 465/2/3 461/2/3 460/2/3
f 466/2/3 461/2/3 465/2/3
f 469/2/3 468/2/3 467/2/3
f 470/2/3 468/2/3 469/2/3
f 473/2/3 472/2/3 471/2/3
f 474/2/3 472/2/3 473/2/3
f 477/2/3 476/2/3 475/2/3
f 478/2/3 476/2/3 477/2/3
f 483/2/3 480/2/3 479/2/3
f 484/2/3 480/2/3 483/2/3
f 485/2/3 482/2/3 481/2/3
f 486/2/3 482/2/3 485/2/3
f 487/2/4 488/2/4 489/2/4
f 489/2/4 488/2/4 490/2/4
f 491/2/4 492/2/4 495/2/4
f 495/2/4 492/2/4 496/2/4
f 493/2/4 494/2/4 497/2/4
f 497/2/4 494/2/4 498/2/4
f 499/2/4 500/2/4 501/2/4
f 501/2/4 500/2/4 502/2/4
f 503/2/4 504/2/4 505/2/4
f 505/2/4 504/2/4 506/2/4
f 507/2/4 508/2/4 509/2/4
f 509/2/4 508/2/4 510/2/4
f 512/2/4 513/2/4 514/2/4
f 511/2/4 512/2/4 514/2/4
f 514/2/4 513/2/4 515/2/4
f 516/1/4 517/1/4 518/1/4
f 518/1/4 517/1/4 519/1/4
f 520/2/4 521/2/4 524/2/4
f 524/2/4 521/2/4 525/2/4
f 525/2/4 521/2/4 526/2/4
f 522/2/4 523/2/4 527/2/4
f 527/2/4 523/2/4 528/2/4
f 529/2/4 530/2/4 536/2/4
f 536/2/4 530/2/4 537/2/4
f 531/2/4 532/2/4 538/2/4
f 538/2/4 532/2/4 539/2/4
f 533/2/4 534/2/4 540/2/4
f 540/2/4 534/2/4 541/2/4
f 535/1/4 536/1/4 543/1/4
f 543/1/4 536/1/4 544/1/4
f 541/1/4 542/1/4 545/1/4
f 545/1/4 542/1/4 546/1/4
f 547/1/4 548/1/4 550/1/4
f 550/1/4 548/1/4 551/1/4
f 549/2/4 550/2/4 554/2/4
f 554/2/4 550/2/4 555/2/4
f 552/1/4 553/1/4 556/1/4
f 556/1/4 553/1/4 557/1/4
f 557/2/4 558/2/4 561/2/4
f 561/2/4 558/2/4 562/2/4
f 559/2/4 560/2/4 563/2/4
f 563/2/4 560/2/4 564/2/4
f 565/2/4 566/2/4 568/2/4
f 568/2/4 566/2/4 569/2/4
f 567/1/4 568/1/4 575/1/4
f 575/1/4 568/1/4 576/1/4
f 570/2/4 571/2/4 577/2/4
f 577/2/4 571/2/4 578/2/4
f 572/1/4 573/1/4 579/1/4
f 579/1/4 573/1/4 580/1/4
f 574/1/4 575/1/4 581/1/4
f 581/1/4 575/1/4 582/1/4
f 582/1/4 575/1/4 583/1/4
f 580/1/4 581/1/4 585/1/4
f 581/1/4 582/1/4 585/1/4
f 585/1/4 582/1/4 586/1/4
f 586/1/4 582/1/4 587/1/4
f 584/1/4 585/1/4 589/1/4
f 589/1/4 585/1/4 590/1/4
f 587/1/4 588/1/4 591/1/4
f 586/1/4 587/1/4 591/1/4
f 591/1/4 588/1/4 592/1/4
f 592/1/4 593/1/4 596/1/4
f 596/1/4 593/1/4 597/1/4
f 594/2/4 595/2/4 599/2/4
f 599/2/4 595/2/4 600/2/4
f 597/2/4 598/2/4 601/2/4
f 601/2/4 598/2/4 602/2/4
f 603/1/4 604/1/4 606/1/4
f 606/1/4 604/1/4 607/1/4
f 607/1/4 604/1/4 608/1/4
f 605/1/4 606/1/4 611/1/4
f 611/1/4 606/1/4 612/1/4
f 607/1/4 608/1/4 613/1/4
f 608/2/4 609/2/4 614/2/4
f 613/1/4 608/1/4 614/1/4
f 614/2/4 609/2/4 615/2/4
f 615/2/4 609/2/4 616/2/4
f 610/1/4 611/1/4 617/1/4
f 617/1/4 611/1/4 618/1/4
f 612/1/4 613/1/4 619/1/4
f 613/1/4 614/1/4 619/1/4
f 619/1/4 614/1/4 620/1/4
f 620/1/4 614/1/4 621/1/4
f 618/1/4 619/1/4 624/1/4
f 624/1/4 619/1/4 625/1/4
f 620/1/4 621/1/4 626/1/4
f 622/2/4 623/2/4 627/2/4
f 621/2/4 622/2/4 627/2/4
f 626/1/4 621/1/4 627/1/4
f 627/2/4 623/2/4 628/2/4
f 625/1/4 626/1/4 629/1/4
f 626/1/4 627/1/4 629/1/4
f 629/1/4 627/1/4 630/1/4
f 633/2/4 634/2/4 636/2/4
f 636/2/4 634/2/4 637/2/4
f 635/2/4 636/2/4 640/2/4
f 640/2/4 636/2/4 641/2/4
f 638/2/4 639/2/4 643/2/4
f 643/2/4 639/2/4 644/2/4
f 641/2/4 642/2/4 645/2/4
f 645/2/4 642/2/4 646/2/4
f 631/2/4 632/2/4 647/2/4
f 647/2/4 632/2/4 648/2/4
f 651/2/5 650/2/5 649/2/5
f 652/2/5 650/2/5 651/2/5
f 653/2/5 650/2/5 652/2/5
f 654/2/5 650/2/5 653/2/5
f 656/2/5 653/2/5 652/2/5
f 657/2/5 653/2/5 656/2/5
f 659/2/5 651/2/5 649/2/5
f 660/1/5 656/1/5 655/1/5
f 661/2/5 657/2/5 656/2/5
f 661/1/5 656/1/5 660/1/5
f 662/1/5 658/1/5 657/1/5
f 662/2/5 657/2/5 661/2/5
f 663/1/5 658/1/5 662/1/5
f 664/2/5 650/2/5 654/2/5
f 665/2/5 661/2/5 660/2/5
f 665/2/5 664/2/5 663/2/5
f 665/2/5 663/2/5 662/2/5
f 665/2/5 659/2/5 649/2/5
f 665/2/5 662/2/5 661/2/5
f 665/2/5 660/2/5 659/2/5
f 666/2/5 664/2/5 665/2/5
f 667/2/5 664/2/5 666/2/5
f 668/2/5 664/2/5 667/2/5
f 669/2/5 664/2/5 668/2/5
f 670/2/5 650/2/5 664/2/5
f 670/2/5 664/2/5 669/2/5
f 671/1/5 667/1/5 666/1/5
f 672/2/5 668/2/5 667/2/5
f 672/1/5 667/1/5 671/1/5
f 673/1/5 669/1/5 668/1/5
f 673/2/5 668/2/5 672/2/5
f 674/1/5 669/1/5 673/1/5
f 675/2/5 665/2/5 649/2/5
f 676/2/5 673/2/5 672/2/5
f 677/2/5 673/2/5 676/2/5
f 678/2/5 650/2/5 670/2/5
f 679/2/5 677/2/5 676/2/5
f 679/2/5 678/2/5 677/2/5
f 679/2/5 675/2/5 649/2/5
f 679/2/5 676/2/5 675/2/5
f 680/2/5 650/2/5 678/2/5
f 680/2/5 678/2/5 679/2/5
f 685/1/5 682/1/5 681/1/5
f 686/1/5 682/1/5 685/1/5
f 687/1/5 684/1/5 683/1/5
f 688/1/5 684/1/5 687/1/5
f 693/1/5 690/1/5 689/1/5
f 694/1/5 690/1/5 693/1/5
f 695/1/5 692/1/5 691/1/5
f 696/1/5 692/1/5 695/1/5
f 699/1/5 698/1/5 697/1/5
f 700/1/5 698/1/5 699/1/5
f 705/1/5 702/1/5 701/1/5
f 706/1/5 702/1/5 705/1/5
f 707/1/5 704/1/5 703/1/5
f 708/1/5 704/1/5 707/1/5
f 711/1/5 710/1/5 709/1/5
f 712/1/5 710/1/5 711/1/5
f 716/2/5 714/2/5 713/2/5
f 717/2/5 714/2/5 716/2/5
f 720/1/5 716/1/5 715/1/5
f 721/1/5 716/1/5 720/1/5
f 722/1/5 718/1/5 717/1/5
f 723/1/5 718/1/5 722/1/5
f 726/1/5 720/1/5 719/1/5
f 727/1/5 720/1/5 726/1/5
f 728/1/5 724/1/5 723/1/5
f 729/1/5 724/1/5 728/1/5
f 731/2/5 726/2/5 725/2/5
f 732/2/5 726/2/5 731/2/5
f 735/2/5 730/2/5 729/2/5
f 736/2/5 730/2/5 735/2/5
f 737/1/5 733/1/5 732/1/5
f 738/1/5 733/1/5 737/1/5
f 741/1/5 735/1/5 734/1/5
f 742/1/5 735/1/5 741/1/5
f 743/1/5 739/1/5 738/1/5
f 744/1/5 739/1/5 743/1/5
f 745/1/5 741/1/5 740/1/5
f 746/1/5 741/1/5 745/1/5
f 747/2/5 745/2/5 744/2/5
f 748/2/5 745/2/5 747/2/5
f 754/2/5 750/2/5 749/2/5
f 755/2/5 750/2/5 754/2/5
f 756/2/5 752/2/5 751/2/5
f 757/2/5 752/2/5 756/2/5
f 760/1/5 754/1/5 753/1/5
f 761/1/5 754/1/5 760/1/5
f 762/1/5 758/1/5 757/1/5
f 763/1/5 758/1/5 762/1/5
f 765/2/5 760/2/5 759/2/5
f 766/2/5 760/2/5 765/2/5
f 767/2/5 764/2/5 763/2/5
f 768/2/5 764/2/5 767/2/5
f 773/2/5 770/2/5 769/2/5
f 774/2/5 770/2/5 773/2/5
f 777/2/5 772/2/5 771/2/5
f 778/2/5 772/2/5 777/2/5
f 779/1/5 775/1/5 774/1/5
f 780/1/5 775/1/5 779/1/5
f 783/1/5 777/1/5 776/1/5
f 784/1/5 777/1/5 783/1/5
f 785/2/5 781/2/5 780/2/5
f 786/2/5 781/2/5 785/2/5
f 787/2/5 783/2/5 782/2/5
f 788/2/5 783/2/5 787/2/5
f 791/2/5 790/2/5 789/2/5
f 792/2/5 790/2/5 791/2/5
f 797/2/5 794/2/5 793/2/5
f 798/2/5 794/2/5 797/2/5
f 799/2/5 796/2/5 795/2/5
f 800/2/5 796/2/5 799/2/5
f 803/2/5 802/2/5 801/2/5
f 804/2/5 802/2/5 803/2/5
f 805/2/6 806/2/6 807/2/6
f 807/2/6 806/2/6 808/2/6
f 808/2/6 806/2/6 809/2/6
f 809/2/6 806/2/6 810/2/6
f 808/2/6 809/2/6 812/2/6
f 812/2/6 809/2/6 813/2/6
f 805/2/6 807/2/6 815/2/6
f 811/1/6 812/1/6 816/1/6
f 816/1/6 812/1/6 817/1/6
f 813/1/6 814/1/6 818/1/6
f 818/1/6 814/1/6 819/1/6
f 810/2/6 806/2/6 820/2/6
f 805/2/6 815/2/6 821/2/6
f 815/2/6 816/2/6 821/2/6
f 821/2/6 816/2/6 822/2/6
f 819/2/6 820/2/6 825/2/6
f 820/2/6 806/2/6 826/2/6
f 825/2/6 820/2/6 826/2/6
f 822/1/6 823/1/6 827/1/6
f 827/1/6 823/1/6 828/1/6
f 824/1/6 825/1/6 829/1/6
f 829/1/6 825/1/6 830/1/6
f 805/2/6 821/2/6 831/2/6
f 828/2/6 829/2/6 832/2/6
f 832/2/6 829/2/6 833/2/6
f 826/2/6 806/2/6 834/2/6
f 832/2/6 833/2/6 835/2/6
f 833/2/6 834/2/6 835/2/6
f 831/2/6 832/2/6 835/2/6
f 805/2/6 831/2/6 835/2/6
f 834/2/6 806/2/6 836/2/6
f 835/2/6 834/2/6 836/2/6
f 837/2/6 838/2/6 839/2/6
f 839/2/6 838/2/6 840/2/6
f 841/2/6 842/2/6 845/2/6
f 845/2/6 842/2/6 846/2/6
f 843/2/6 844/2/6 847/2/6
f 847/2/6 844/2/6 848/2/6
f 849/2/6 850/2/6 851/2/6
f 851/2/6 850/2/6 852/2/6
f 853/2/6 854/2/6 857/2/6
f 857/2/6 854/2/6 858/2/6
f 855/2/6 856/2/6 859/2/6
f 859/2/6 856/2/6 860/2/6
f 861/2/6 862/2/6 865/2/6
f 865/2/6 862/2/6 866/2/6
f 863/2/6 864/2/6 867/2/6
f 867/2/6 864/2/6 868/2/6
f 869/2/6 870/2/6 873/2/6
f 873/2/6 870/2/6 874/2/6
f 871/2/6 872/2/6 875/2/6
f 875/2/6 872/2/6 876/2/6
f 877/2/6 878/2/6 881/2/6
f 881/2/6 878/2/6 882/2/6
f 879/2/6 880/2/6 883/2/6
f 883/2/6 880/2/6 884/2/6
f 885/1/6 886/1/6 887/1/6
f 887/1/6 886/1/6 888/1/6
f 889/1/6 890/1/6 895/1/6
f 895/1/6 890/1/6 896/1/6
f 891/1/6 892/1/6 897/1/6
f 897/1/6 892/1/6 898/1/6
f 893/1/6 894/1/6 899/1/6
f 899/1/6 894/1/6 900/1/6
f 897/1/6 898/1/6 902/1/6
f 898/1/6 899/1/6 902/1/6
f 896/1/6 897/1/6 902/1/6
f 902/1/6 899/1/6 903/1/6
f 903/1/6 899/1/6 904/1/6
f 904/1/6 899/1/6 905/1/6
f 901/1/6 902/1/6 907/1/6
f 902/1/6 903/1/6 907/1/6
f 907/1/6 903/1/6 908/1/6
f 908/1/6 903/1/6 909/1/6
f 905/1/6 906/1/6 910/1/6
f 904/1/6 905/1/6 910/1/6
f 910/1/6 906/1/6 911/1/6
f 911/1/6 906/1/6 912/1/6
f 908/1/6 909/1/6 914/1/6
f 910/1/6 911/1/6 914/1/6
f 909/1/6 910/1/6 914/1/6
f 914/1/6 911/1/6 915/1/6
f 915/1/6 911/1/6 916/1/6
f 916/1/6 911/1/6 917/1/6
f 913/1/6 914/1/6 919/1/6
f 919/1/6 914/1/6 920/1/6
f 915/1/6 916/1/6 921/1/6
f 921/1/6 916/1/6 922/1/6
f 917/1/6 918/1/6 923/1/6
f 923/1/6 918/1/6 924/1/6
f 925/2/6 926/2/6 928/2/6
f 928/2/6 926/2/6 929/2/6
f 927/2/6 928/2/6 932/2/6
f 932/2/6 928/2/6 933/2/6
f 929/2/6 930/2/6 934/2/6
f 934/2/6 930/2/6 935/2/6
f 931/2/6 932/2/6 938/2/6
f 938/2/6 932/2/6 939/2/6
f 935/2/6 936/2/6 940/2/6
f 940/2/6 936/2/6 941/2/6
f 937/2/6 938/2/6 943/2/6
f 943/2/6 938/2/6 944/2/6
f 941/2/6 942/2/6 947/2/6
f 947/2/6 942/2/6 948/2/6
f 944/2/6 945/2/6 949/2/6
f 949/2/6 945/2/6 950/2/6
f 946/2/6 947/2/6 953/2/6
f 953/2/6 947/2/6 954/2/6
f 950/2/6 951/2/6 955/2/6
f 955/2/6 951/2/6 956/2/6
f 952/2/6 953/2/6 957/2/6
f 957/2/6 953/2/6 958/2/6
f 956/2/6 957/2/6 959/2/6
f 959/2/6 957/2/6 960/2/6
