# MagicaVoxel @ Ephtracy

# group
o 

# material
mtllib Dad.mtl
usemtl palette

# normals
vn -1 0 0
vn 1 0 0
vn 0 0 1
vn 0 0 -1
vn 0 -1 0
vn 0 1 0

# texcoords
vt 0.970703 0.5
vt 0.974609 0.5
vt 0.982422 0.5

# verts
v -0.6 1.2 0.1
v -0.6 1.2 -0.2
v -0.6 2.3 0.1
v -0.6 2.3 -0.2
v -0.5 1 0.1
v -0.5 1 -0.2
v -0.5 1.2 0.1
v -0.5 1.2 -0.2
v -0.5 2.3 0.1
v -0.5 2.3 -0.2
v -0.5 2.5 0.1
v -0.5 2.5 -0.2
v -0.4 0 0.1
v -0.4 0 7.45058e-009
v -0.4 0.2 0.1
v -0.4 0.2 7.45058e-009
v -0.4 1 0.1
v -0.4 1 7.45058e-009
v -0.4 3.1 0.1
v -0.4 3.1 -0.2
v -0.4 3.9 0.1
v -0.4 3.9 -0.2
v -0.3 0 0.2
v -0.3 0 0.1
v -0.3 0 7.45058e-009
v -0.3 0 -0.1
v -0.3 0.1 0.2
v -0.3 0.1 0.1
v -0.3 0.1 7.45058e-009
v -0.3 0.1 -0.1
v -0.3 1.3 -0.2
v -0.3 1.3 -0.3
v -0.3 1.5 -0.2
v -0.3 1.5 -0.3
v -0.3 2.2 -0.2
v -0.3 2.2 -0.3
v -0.3 3 0.1
v -0.3 3 -0.2
v -0.3 3.1 0.1
v -0.3 3.1 -0.2
v -0.3 3.9 0.1
v -0.3 3.9 -0.2
v -0.3 4 0.1
v -0.3 4 -0.2
v -0.2 1.4 0.2
v -0.2 1.4 0.1
v -0.2 1.6 0.2
v -0.2 1.6 0.1
v -0.2 2.2 0.2
v -0.2 2.2 0.1
v -0.2 2.5 0.1
v -0.2 2.5 -0.2
v -0.2 2.9 0.1
v -0.2 2.9 -0.2
v -0.2 3.4 0.2
v -0.2 3.4 0.1
v -0.2 3.7 0.2
v -0.2 3.7 0.1
v -0.1 2.9 7.45058e-009
v -0.1 2.9 -0.1
v -0.1 3 7.45058e-009
v -0.1 3 -0.1
v 0.1 0 -0.1
v 0.1 0 -0.2
v 0.1 0.2 -0.1
v 0.1 0.2 -0.2
v 0.1 1 -0.1
v 0.1 1 -0.2
v 0.2 0 7.45058e-009
v 0.2 0 -0.1
v 0.2 0 -0.2
v 0.2 0 -0.3
v 0.2 0.1 7.45058e-009
v 0.2 0.1 -0.1
v 0.2 0.1 -0.2
v 0.2 0.1 -0.3
v 0.2 2.5 0.1
v 0.2 2.5 7.45058e-009
v 0.2 2.5 -0.1
v 0.2 2.5 -0.2
v 0.2 2.8 0.1
v 0.2 2.8 7.45058e-009
v 0.2 2.8 -0.1
v 0.2 2.8 -0.2
v 0.4 3.5 0.2
v 0.4 3.5 0.1
v 0.4 3.6 0.2
v 0.4 3.6 0.1
v 0.4 3.6 -0.2
v 0.4 3.6 -0.3
v 0.4 3.7 -0.2
v 0.4 3.7 -0.3
v -0.2 0 0.2
v -0.2 0 0.1
v -0.2 0 7.45058e-009
v -0.2 0 -0.1
v -0.2 0.1 0.2
v -0.2 0.1 0.1
v -0.2 0.1 7.45058e-009
v -0.2 0.1 -0.1
v -0.1 0 0.1
v -0.1 0 7.45058e-009
v -0.1 0.2 0.1
v -0.1 0.2 7.45058e-009
v -0.1 1 0.1
v -0.1 1 7.45058e-009
v -0.1 3.4 0.2
v -0.1 3.4 0.1
v -0.1 3.7 0.2
v -0.1 3.7 0.1
v -3.72529e-008 1.3 -0.2
v -3.72529e-008 1.3 -0.3
v -3.72529e-008 1.5 -0.2
v -3.72529e-008 1.5 -0.3
v -3.72529e-008 2.2 -0.2
v -3.72529e-008 2.2 -0.3
v -3.72529e-008 2.5 0.1
v -3.72529e-008 2.5 7.45058e-009
v -3.72529e-008 2.5 -0.1
v -3.72529e-008 2.5 -0.2
v -3.72529e-008 2.9 0.1
v -3.72529e-008 2.9 7.45058e-009
v -3.72529e-008 2.9 -0.1
v -3.72529e-008 2.9 -0.2
v 0.1 1.4 0.2
v 0.1 1.4 0.1
v 0.1 1.6 0.2
v 0.1 1.6 0.1
v 0.1 2.2 0.2
v 0.1 2.2 0.1
v 0.2 2.8 7.45058e-009
v 0.2 2.8 -0.1
v 0.2 3 7.45058e-009
v 0.2 3 -0.1
v 0.3 0 7.45058e-009
v 0.3 0 -0.1
v 0.3 0 -0.2
v 0.3 0 -0.3
v 0.3 0.1 7.45058e-009
v 0.3 0.1 -0.1
v 0.3 0.1 -0.2
v 0.3 0.1 -0.3
v 0.3 2.5 0.1
v 0.3 2.5 -0.2
v 0.3 2.6 7.45058e-009
v 0.3 2.6 -0.1
v 0.3 2.7 7.45058e-009
v 0.3 2.7 -0.1
v 0.3 2.8 0.1
v 0.3 2.8 -0.2
v 0.4 0 -0.1
v 0.4 0 -0.2
v 0.4 0.2 -0.1
v 0.4 0.2 -0.2
v 0.4 1 -0.1
v 0.4 1 -0.2
v 0.4 2.6 7.45058e-009
v 0.4 2.6 -0.1
v 0.4 2.7 7.45058e-009
v 0.4 2.7 -0.1
v 0.5 3 0.1
v 0.5 3 -0.2
v 0.5 3.1 0.1
v 0.5 3.1 -0.2
v 0.5 3.5 0.2
v 0.5 3.5 0.1
v 0.5 3.6 0.2
v 0.5 3.6 0.1
v 0.5 3.6 -0.2
v 0.5 3.6 -0.3
v 0.5 3.7 -0.2
v 0.5 3.7 -0.3
v 0.5 3.9 0.1
v 0.5 3.9 -0.2
v 0.5 4 0.1
v 0.5 4 -0.2
v 0.6 1 0.1
v 0.6 1 -0.2
v 0.6 1.2 0.1
v 0.6 1.2 -0.2
v 0.6 2.3 0.1
v 0.6 2.3 -0.2
v 0.6 2.5 0.1
v 0.6 2.5 -0.2
v 0.6 3.1 0.1
v 0.6 3.1 -0.2
v 0.6 3.2 7.45058e-009
v 0.6 3.2 -0.1
v 0.6 3.4 7.45058e-009
v 0.6 3.4 -0.1
v 0.6 3.9 0.1
v 0.6 3.9 -0.2
v 0.7 1.2 0.1
v 0.7 1.2 -0.2
v 0.7 2.3 0.1
v 0.7 2.3 -0.2
v 0.7 3.2 7.45058e-009
v 0.7 3.2 -0.1
v 0.7 3.4 7.45058e-009
v 0.7 3.4 -0.1
v -0.3 0 0.2
v -0.3 0.1 0.2
v -0.2 0 0.2
v -0.2 0.1 0.2
v -0.2 1.4 0.2
v -0.2 1.6 0.2
v -0.2 2.2 0.2
v -0.2 3.4 0.2
v -0.2 3.7 0.2
v -0.1 3.4 0.2
v -0.1 3.7 0.2
v 0.1 1.4 0.2
v 0.1 1.6 0.2
v 0.1 2.2 0.2
v 0.4 3.5 0.2
v 0.4 3.6 0.2
v 0.5 3.5 0.2
v 0.5 3.6 0.2
v -0.6 1.2 0.1
v -0.6 2.3 0.1
v -0.5 1 0.1
v -0.5 1.2 0.1
v -0.5 2.3 0.1
v -0.5 2.5 0.1
v -0.4 0 0.1
v -0.4 0.2 0.1
v -0.4 1 0.1
v -0.4 3.1 0.1
v -0.4 3.9 0.1
v -0.3 0 0.1
v -0.3 0.1 0.1
v -0.3 3 0.1
v -0.3 3.1 0.1
v -0.3 3.9 0.1
v -0.3 4 0.1
v -0.2 0 0.1
v -0.2 0.1 0.1
v -0.2 1.4 0.1
v -0.2 1.6 0.1
v -0.2 2.2 0.1
v -0.2 2.5 0.1
v -0.2 2.9 0.1
v -0.2 3.4 0.1
v -0.2 3.7 0.1
v -0.1 0 0.1
v -0.1 0.2 0.1
v -0.1 1 0.1
v -0.1 3.4 0.1
v -0.1 3.7 0.1
v -3.72529e-008 2.5 0.1
v -3.72529e-008 2.9 0.1
v 0.1 1.4 0.1
v 0.1 1.6 0.1
v 0.1 2.2 0.1
v 0.2 2.5 0.1
v 0.2 2.8 0.1
v 0.3 2.5 0.1
v 0.3 2.8 0.1
v 0.4 3.5 0.1
v 0.4 3.6 0.1
v 0.5 3 0.1
v 0.5 3.1 0.1
v 0.5 3.5 0.1
v 0.5 3.6 0.1
v 0.5 3.9 0.1
v 0.5 4 0.1
v 0.6 1 0.1
v 0.6 1.2 0.1
v 0.6 2.3 0.1
v 0.6 2.5 0.1
v 0.6 3.1 0.1
v 0.6 3.9 0.1
v 0.7 1.2 0.1
v 0.7 2.3 0.1
v -0.1 2.9 7.45058e-009
v -0.1 3 7.45058e-009
v -3.72529e-008 2.5 7.45058e-009
v -3.72529e-008 2.9 7.45058e-009
v 0.2 0 7.45058e-009
v 0.2 0.1 7.45058e-009
v 0.2 2.5 7.45058e-009
v 0.2 2.8 7.45058e-009
v 0.2 3 7.45058e-009
v 0.3 0 7.45058e-009
v 0.3 0.1 7.45058e-009
v 0.3 2.6 7.45058e-009
v 0.3 2.7 7.45058e-009
v 0.4 2.6 7.45058e-009
v 0.4 2.7 7.45058e-009
v 0.6 3.2 7.45058e-009
v 0.6 3.4 7.45058e-009
v 0.7 3.2 7.45058e-009
v 0.7 3.4 7.45058e-009
v 0.1 0 -0.1
v 0.1 0.2 -0.1
v 0.1 1 -0.1
v 0.2 0 -0.1
v 0.2 0.1 -0.1
v 0.3 0 -0.1
v 0.3 0.1 -0.1
v 0.4 0 -0.1
v 0.4 0.2 -0.1
v 0.4 1 -0.1
v -0.4 0 7.45058e-009
v -0.4 0.2 7.45058e-009
v -0.4 1 7.45058e-009
v -0.3 0 7.45058e-009
v -0.3 0.1 7.45058e-009
v -0.2 0 7.45058e-009
v -0.2 0.1 7.45058e-009
v -0.1 0 7.45058e-009
v -0.1 0.2 7.45058e-009
v -0.1 1 7.45058e-009
v -0.3 0 -0.1
v -0.3 0.1 -0.1
v -0.2 0 -0.1
v -0.2 0.1 -0.1
v -0.1 2.9 -0.1
v -0.1 3 -0.1
v -3.72529e-008 2.5 -0.1
v -3.72529e-008 2.9 -0.1
v 0.2 2.5 -0.1
v 0.2 2.8 -0.1
v 0.2 3 -0.1
v 0.3 2.6 -0.1
v 0.3 2.7 -0.1
v 0.4 2.6 -0.1
v 0.4 2.7 -0.1
v 0.6 3.2 -0.1
v 0.6 3.4 -0.1
v 0.7 3.2 -0.1
v 0.7 3.4 -0.1
v -0.6 1.2 -0.2
v -0.6 2.3 -0.2
v -0.5 1 -0.2
v -0.5 1.2 -0.2
v -0.5 2.3 -0.2
v -0.5 2.5 -0.2
v -0.4 3.1 -0.2
v -0.4 3.9 -0.2
v -0.3 1.3 -0.2
v -0.3 1.5 -0.2
v -0.3 2.2 -0.2
v -0.3 3 -0.2
v -0.3 3.1 -0.2
v -0.3 3.9 -0.2
v -0.3 4 -0.2
v -0.2 2.5 -0.2
v -0.2 2.9 -0.2
v -3.72529e-008 1.3 -0.2
v -3.72529e-008 1.5 -0.2
v -3.72529e-008 2.2 -0.2
v -3.72529e-008 2.5 -0.2
v -3.72529e-008 2.9 -0.2
v 0.1 0 -0.2
v 0.1 0.2 -0.2
v 0.1 1 -0.2
v 0.2 0 -0.2
v 0.2 0.1 -0.2
v 0.2 2.5 -0.2
v 0.2 2.8 -0.2
v 0.3 0 -0.2
v 0.3 0.1 -0.2
v 0.3 2.5 -0.2
v 0.3 2.8 -0.2
v 0.4 0 -0.2
v 0.4 0.2 -0.2
v 0.4 1 -0.2
v 0.4 3.6 -0.2
v 0.4 3.7 -0.2
v 0.5 3 -0.2
v 0.5 3.1 -0.2
v 0.5 3.6 -0.2
v 0.5 3.7 -0.2
v 0.5 3.9 -0.2
v 0.5 4 -0.2
v 0.6 1 -0.2
v 0.6 1.2 -0.2
v 0.6 2.3 -0.2
v 0.6 2.5 -0.2
v 0.6 3.1 -0.2
v 0.6 3.9 -0.2
v 0.7 1.2 -0.2
v 0.7 2.3 -0.2
v -0.3 1.3 -0.3
v -0.3 1.5 -0.3
v -0.3 2.2 -0.3
v -3.72529e-008 1.3 -0.3
v -3.72529e-008 1.5 -0.3
v -3.72529e-008 2.2 -0.3
v 0.2 0 -0.3
v 0.2 0.1 -0.3
v 0.3 0 -0.3
v 0.3 0.1 -0.3
v 0.4 3.6 -0.3
v 0.4 3.7 -0.3
v 0.5 3.6 -0.3
v 0.5 3.7 -0.3
v -0.3 0 0.2
v -0.2 0 0.2
v -0.4 0 0.1
v -0.3 0 0.1
v -0.2 0 0.1
v -0.1 0 0.1
v -0.4 0 7.45058e-009
v -0.3 0 7.45058e-009
v -0.2 0 7.45058e-009
v -0.1 0 7.45058e-009
v 0.2 0 7.45058e-009
v 0.3 0 7.45058e-009
v -0.3 0 -0.1
v -0.2 0 -0.1
v 0.1 0 -0.1
v 0.2 0 -0.1
v 0.3 0 -0.1
v 0.4 0 -0.1
v 0.1 0 -0.2
v 0.2 0 -0.2
v 0.3 0 -0.2
v 0.4 0 -0.2
v 0.2 0 -0.3
v 0.3 0 -0.3
v -0.5 1 0.1
v -0.4 1 0.1
v -0.1 1 0.1
v 0.6 1 0.1
v -0.4 1 7.45058e-009
v -0.1 1 7.45058e-009
v 0.1 1 -0.1
v 0.4 1 -0.1
v -0.5 1 -0.2
v 0.1 1 -0.2
v 0.4 1 -0.2
v 0.6 1 -0.2
v -0.6 1.2 0.1
v -0.5 1.2 0.1
v 0.6 1.2 0.1
v 0.7 1.2 0.1
v -0.6 1.2 -0.2
v -0.5 1.2 -0.2
v 0.6 1.2 -0.2
v 0.7 1.2 -0.2
v -0.3 1.3 -0.2
v -3.72529e-008 1.3 -0.2
v -0.3 1.3 -0.3
v -3.72529e-008 1.3 -0.3
v -0.2 1.4 0.2
v 0.1 1.4 0.2
v -0.2 1.4 0.1
v 0.1 1.4 0.1
v 0.3 2.6 7.45058e-009
v 0.4 2.6 7.45058e-009
v 0.3 2.6 -0.1
v 0.4 2.6 -0.1
v -0.3 3 0.1
v 0.5 3 0.1
v -0.1 3 7.45058e-009
v 0.2 3 7.45058e-009
v -0.1 3 -0.1
v 0.2 3 -0.1
v -0.3 3 -0.2
v 0.5 3 -0.2
v -0.4 3.1 0.1
v -0.3 3.1 0.1
v 0.5 3.1 0.1
v 0.6 3.1 0.1
v -0.4 3.1 -0.2
v -0.3 3.1 -0.2
v 0.5 3.1 -0.2
v 0.6 3.1 -0.2
v 0.6 3.2 7.45058e-009
v 0.7 3.2 7.45058e-009
v 0.6 3.2 -0.1
v 0.7 3.2 -0.1
v -0.2 3.4 0.2
v -0.1 3.4 0.2
v -0.2 3.4 0.1
v -0.1 3.4 0.1
v 0.4 3.5 0.2
v 0.5 3.5 0.2
v 0.4 3.5 0.1
v 0.5 3.5 0.1
v 0.4 3.6 -0.2
v 0.5 3.6 -0.2
v 0.4 3.6 -0.3
v 0.5 3.6 -0.3
v -0.3 0.1 0.2
v -0.2 0.1 0.2
v -0.3 0.1 0.1
v -0.2 0.1 0.1
v -0.3 0.1 7.45058e-009
v -0.2 0.1 7.45058e-009
v 0.2 0.1 7.45058e-009
v 0.3 0.1 7.45058e-009
v -0.3 0.1 -0.1
v -0.2 0.1 -0.1
v 0.2 0.1 -0.1
v 0.3 0.1 -0.1
v 0.2 0.1 -0.2
v 0.3 0.1 -0.2
v 0.2 0.1 -0.3
v 0.3 0.1 -0.3
v -0.2 2.2 0.2
v 0.1 2.2 0.2
v -0.2 2.2 0.1
v 0.1 2.2 0.1
v -0.3 2.2 -0.2
v -3.72529e-008 2.2 -0.2
v -0.3 2.2 -0.3
v -3.72529e-008 2.2 -0.3
v -0.6 2.3 0.1
v -0.5 2.3 0.1
v 0.6 2.3 0.1
v 0.7 2.3 0.1
v -0.6 2.3 -0.2
v -0.5 2.3 -0.2
v 0.6 2.3 -0.2
v 0.7 2.3 -0.2
v -0.5 2.5 0.1
v -0.2 2.5 0.1
v -3.72529e-008 2.5 0.1
v 0.2 2.5 0.1
v 0.3 2.5 0.1
v 0.6 2.5 0.1
v -3.72529e-008 2.5 7.45058e-009
v 0.2 2.5 7.45058e-009
v -3.72529e-008 2.5 -0.1
v 0.2 2.5 -0.1
v -0.5 2.5 -0.2
v -0.2 2.5 -0.2
v -3.72529e-008 2.5 -0.2
v 0.2 2.5 -0.2
v 0.3 2.5 -0.2
v 0.6 2.5 -0.2
v 0.3 2.7 7.45058e-009
v 0.4 2.7 7.45058e-009
v 0.3 2.7 -0.1
v 0.4 2.7 -0.1
v 0.2 2.8 0.1
v 0.3 2.8 0.1
v 0.2 2.8 7.45058e-009
v 0.2 2.8 -0.1
v 0.2 2.8 -0.2
v 0.3 2.8 -0.2
v -0.2 2.9 0.1
v -3.72529e-008 2.9 0.1
v -0.1 2.9 7.45058e-009
v -3.72529e-008 2.9 7.45058e-009
v -0.1 2.9 -0.1
v -3.72529e-008 2.9 -0.1
v -0.2 2.9 -0.2
v -3.72529e-008 2.9 -0.2
v 0.6 3.4 7.45058e-009
v 0.7 3.4 7.45058e-009
v 0.6 3.4 -0.1
v 0.7 3.4 -0.1
v 0.4 3.6 0.2
v 0.5 3.6 0.2
v 0.4 3.6 0.1
v 0.5 3.6 0.1
v -0.2 3.7 0.2
v -0.1 3.7 0.2
v -0.2 3.7 0.1
v -0.1 3.7 0.1
v 0.4 3.7 -0.2
v 0.5 3.7 -0.2
v 0.4 3.7 -0.3
v 0.5 3.7 -0.3
v -0.4 3.9 0.1
v -0.3 3.9 0.1
v 0.5 3.9 0.1
v 0.6 3.9 0.1
v -0.4 3.9 -0.2
v -0.3 3.9 -0.2
v 0.5 3.9 -0.2
v 0.6 3.9 -0.2
v -0.3 4 0.1
v 0.5 4 0.1
v -0.3 4 -0.2
v 0.5 4 -0.2

# faces
f 3/3/1 2/3/1 1/3/1
f 4/3/1 2/3/1 3/3/1
f 7/3/1 6/3/1 5/3/1
f 8/3/1 6/3/1 7/3/1
f 11/3/1 10/3/1 9/3/1
f 12/3/1 10/3/1 11/3/1
f 15/1/1 14/1/1 13/1/1
f 16/1/1 14/1/1 15/1/1
f 17/3/1 16/3/1 15/3/1
f 18/3/1 16/3/1 17/3/1
f 21/3/1 20/3/1 19/3/1
f 22/3/1 20/3/1 21/3/1
f 27/1/1 24/1/1 23/1/1
f 28/1/1 24/1/1 27/1/1
f 29/1/1 26/1/1 25/1/1
f 30/1/1 26/1/1 29/1/1
f 33/1/1 32/1/1 31/1/1
f 34/1/1 32/1/1 33/1/1
f 35/3/1 34/3/1 33/3/1
f 36/3/1 34/3/1 35/3/1
f 39/3/1 38/3/1 37/3/1
f 40/3/1 38/3/1 39/3/1
f 43/3/1 42/3/1 41/3/1
f 44/3/1 42/3/1 43/3/1
f 47/1/1 46/1/1 45/1/1
f 48/1/1 46/1/1 47/1/1
f 49/3/1 48/3/1 47/3/1
f 50/3/1 48/3/1 49/3/1
f 53/3/1 52/3/1 51/3/1
f 54/3/1 52/3/1 53/3/1
f 57/3/1 56/3/1 55/3/1
f 58/3/1 56/3/1 57/3/1
f 61/3/1 60/3/1 59/3/1
f 62/3/1 60/3/1 61/3/1
f 65/1/1 64/1/1 63/1/1
f 66/1/1 64/1/1 65/1/1
f 67/3/1 66/3/1 65/3/1
f 68/3/1 66/3/1 67/3/1
f 73/1/1 70/1/1 69/1/1
f 74/1/1 70/1/1 73/1/1
f 75/1/1 72/1/1 71/1/1
f 76/1/1 72/1/1 75/1/1
f 81/3/1 78/3/1 77/3/1
f 82/3/1 78/3/1 81/3/1
f 83/3/1 80/3/1 79/3/1
f 84/3/1 80/3/1 83/3/1
f 87/2/1 86/2/1 85/2/1
f 88/2/1 86/2/1 87/2/1
f 91/2/1 90/2/1 89/2/1
f 92/2/1 90/2/1 91/2/1
f 93/1/2 94/1/2 97/1/2
f 97/1/2 94/1/2 98/1/2
f 95/1/2 96/1/2 99/1/2
f 99/1/2 96/1/2 100/1/2
f 101/1/2 102/1/2 103/1/2
f 103/1/2 102/1/2 104/1/2
f 103/3/2 104/3/2 105/3/2
f 105/3/2 104/3/2 106/3/2
f 107/3/2 108/3/2 109/3/2
f 109/3/2 108/3/2 110/3/2
f 111/1/2 112/1/2 113/1/2
f 113/1/2 112/1/2 114/1/2
f 113/3/2 114/3/2 115/3/2
f 115/3/2 114/3/2 116/3/2
f 117/3/2 118/3/2 121/3/2
f 121/3/2 118/3/2 122/3/2
f 119/3/2 120/3/2 123/3/2
f 123/3/2 120/3/2 124/3/2
f 125/1/2 126/1/2 127/1/2
f 127/1/2 126/1/2 128/1/2
f 127/3/2 128/3/2 129/3/2
f 129/3/2 128/3/2 130/3/2
f 131/3/2 132/3/2 133/3/2
f 133/3/2 132/3/2 134/3/2
f 135/1/2 136/1/2 139/1/2
f 139/1/2 136/1/2 140/1/2
f 137/1/2 138/1/2 141/1/2
f 141/1/2 138/1/2 142/1/2
f 143/3/2 144/3/2 145/3/2
f 145/3/2 144/3/2 146/3/2
f 143/3/2 145/3/2 147/3/2
f 146/3/2 144/3/2 148/3/2
f 143/3/2 147/3/2 149/3/2
f 147/3/2 148/3/2 149/3/2
f 148/3/2 144/3/2 150/3/2
f 149/3/2 148/3/2 150/3/2
f 151/1/2 152/1/2 153/1/2
f 153/1/2 152/1/2 154/1/2
f 153/3/2 154/3/2 155/3/2
f 155/3/2 154/3/2 156/3/2
f 157/3/2 158/3/2 159/3/2
f 159/3/2 158/3/2 160/3/2
f 161/3/2 162/3/2 163/3/2
f 163/3/2 162/3/2 164/3/2
f 165/2/2 166/2/2 167/2/2
f 167/2/2 166/2/2 168/2/2
f 169/2/2 170/2/2 171/2/2
f 171/2/2 170/2/2 172/2/2
f 173/3/2 174/3/2 175/3/2
f 175/3/2 174/3/2 176/3/2
f 177/3/2 178/3/2 179/3/2
f 179/3/2 178/3/2 180/3/2
f 181/3/2 182/3/2 183/3/2
f 183/3/2 182/3/2 184/3/2
f 185/3/2 186/3/2 187/3/2
f 187/3/2 186/3/2 188/3/2
f 185/3/2 187/3/2 189/3/2
f 188/3/2 186/3/2 190/3/2
f 185/3/2 189/3/2 191/3/2
f 189/3/2 190/3/2 191/3/2
f 190/3/2 186/3/2 192/3/2
f 191/3/2 190/3/2 192/3/2
f 193/3/2 194/3/2 195/3/2
f 195/3/2 194/3/2 196/3/2
f 197/3/2 198/3/2 199/3/2
f 199/3/2 198/3/2 200/3/2
f 203/1/3 202/1/3 201/1/3
f 204/1/3 202/1/3 203/1/3
f 210/3/3 209/3/3 208/3/3
f 211/3/3 209/3/3 210/3/3
f 212/1/3 206/1/3 205/1/3
f 213/3/3 207/3/3 206/3/3
f 213/1/3 206/1/3 212/1/3
f 214/3/3 207/3/3 213/3/3
f 217/2/3 216/2/3 215/2/3
f 218/2/3 216/2/3 217/2/3
f 222/3/3 220/3/3 219/3/3
f 223/3/3 220/3/3 222/3/3
f 227/3/3 222/3/3 221/3/3
f 227/3/3 223/3/3 222/3/3
f 227/3/3 224/3/3 223/3/3
f 230/1/3 226/1/3 225/1/3
f 231/1/3 226/1/3 230/1/3
f 233/3/3 229/3/3 228/3/3
f 234/3/3 229/3/3 233/3/3
f 237/1/3 226/1/3 231/1/3
f 238/3/3 224/3/3 227/3/3
f 238/3/3 227/3/3 226/3/3
f 239/3/3 224/3/3 238/3/3
f 240/3/3 224/3/3 239/3/3
f 241/3/3 224/3/3 240/3/3
f 243/3/3 234/3/3 233/3/3
f 243/3/3 235/3/3 234/3/3
f 243/3/3 233/3/3 232/3/3
f 244/3/3 235/3/3 243/3/3
f 245/1/3 237/1/3 236/1/3
f 246/1/3 226/1/3 237/1/3
f 246/1/3 237/1/3 245/1/3
f 246/3/3 238/3/3 226/3/3
f 247/3/3 238/3/3 246/3/3
f 248/3/3 243/3/3 232/3/3
f 249/3/3 235/3/3 244/3/3
f 250/3/3 242/3/3 241/3/3
f 250/3/3 241/3/3 240/3/3
f 251/3/3 242/3/3 250/3/3
f 252/3/3 238/3/3 247/3/3
f 254/3/3 250/3/3 240/3/3
f 255/3/3 253/3/3 252/3/3
f 255/3/3 254/3/3 253/3/3
f 255/3/3 250/3/3 254/3/3
f 257/3/3 255/3/3 252/3/3
f 257/3/3 256/3/3 255/3/3
f 258/3/3 256/3/3 257/3/3
f 259/3/3 249/3/3 248/3/3
f 260/3/3 249/3/3 259/3/3
f 261/3/3 248/3/3 232/3/3
f 261/3/3 259/3/3 248/3/3
f 262/3/3 259/3/3 261/3/3
f 263/3/3 259/3/3 262/3/3
f 264/3/3 249/3/3 260/3/3
f 265/3/3 235/3/3 249/3/3
f 265/3/3 249/3/3 264/3/3
f 266/3/3 235/3/3 265/3/3
f 267/3/3 257/3/3 252/3/3
f 267/3/3 252/3/3 247/3/3
f 268/3/3 257/3/3 267/3/3
f 269/3/3 257/3/3 268/3/3
f 270/3/3 257/3/3 269/3/3
f 271/3/3 263/3/3 262/3/3
f 271/3/3 264/3/3 263/3/3
f 271/3/3 265/3/3 264/3/3
f 272/3/3 265/3/3 271/3/3
f 273/3/3 269/3/3 268/3/3
f 274/3/3 269/3/3 273/3/3
f 278/3/3 276/3/3 275/3/3
f 281/3/3 278/3/3 277/3/3
f 282/3/3 278/3/3 281/3/3
f 283/3/3 276/3/3 278/3/3
f 283/3/3 278/3/3 282/3/3
f 284/1/3 280/1/3 279/1/3
f 285/1/3 280/1/3 284/1/3
f 288/3/3 287/3/3 286/3/3
f 289/3/3 287/3/3 288/3/3
f 292/3/3 291/3/3 290/3/3
f 293/3/3 291/3/3 292/3/3
f 297/1/3 295/1/3 294/1/3
f 298/1/3 295/1/3 297/1/3
f 300/1/3 295/1/3 298/1/3
f 301/1/3 300/1/3 299/1/3
f 302/3/3 296/3/3 295/3/3
f 302/1/3 300/1/3 301/1/3
f 302/1/3 295/1/3 300/1/3
f 303/3/3 296/3/3 302/3/3
f 304/1/4 305/1/4 307/1/4
f 307/1/4 305/1/4 308/1/4
f 308/1/4 305/1/4 310/1/4
f 309/1/4 310/1/4 311/1/4
f 305/3/4 306/3/4 312/3/4
f 311/1/4 310/1/4 312/1/4
f 310/1/4 305/1/4 312/1/4
f 312/3/4 306/3/4 313/3/4
f 314/1/4 315/1/4 316/1/4
f 316/1/4 315/1/4 317/1/4
f 318/3/4 319/3/4 321/3/4
f 320/3/4 321/3/4 322/3/4
f 322/3/4 321/3/4 323/3/4
f 321/3/4 319/3/4 324/3/4
f 323/3/4 321/3/4 324/3/4
f 325/3/4 326/3/4 327/3/4
f 327/3/4 326/3/4 328/3/4
f 329/3/4 330/3/4 331/3/4
f 331/3/4 330/3/4 332/3/4
f 333/3/4 334/3/4 336/3/4
f 336/3/4 334/3/4 337/3/4
f 335/3/4 336/3/4 341/3/4
f 336/3/4 337/3/4 341/3/4
f 337/3/4 338/3/4 341/3/4
f 341/3/4 338/3/4 342/3/4
f 342/3/4 338/3/4 343/3/4
f 339/3/4 340/3/4 345/3/4
f 345/3/4 340/3/4 346/3/4
f 343/3/4 338/3/4 348/3/4
f 335/3/4 341/3/4 350/3/4
f 348/3/4 349/3/4 352/3/4
f 343/3/4 348/3/4 352/3/4
f 352/3/4 349/3/4 353/3/4
f 353/3/4 349/3/4 354/3/4
f 350/3/4 351/3/4 357/3/4
f 335/3/4 350/3/4 357/3/4
f 351/3/4 352/3/4 357/3/4
f 352/3/4 353/3/4 357/3/4
f 355/1/4 356/1/4 358/1/4
f 358/1/4 356/1/4 359/1/4
f 356/3/4 357/3/4 360/3/4
f 357/3/4 353/3/4 360/3/4
f 359/1/4 356/1/4 363/1/4
f 356/3/4 360/3/4 364/3/4
f 360/3/4 361/3/4 364/3/4
f 364/3/4 361/3/4 365/3/4
f 362/1/4 363/1/4 366/1/4
f 363/1/4 356/1/4 367/1/4
f 366/1/4 363/1/4 367/1/4
f 356/3/4 364/3/4 367/3/4
f 367/3/4 364/3/4 368/3/4
f 346/3/4 347/3/4 369/3/4
f 345/3/4 346/3/4 369/3/4
f 344/3/4 345/3/4 369/3/4
f 369/3/4 347/3/4 370/3/4
f 344/3/4 369/3/4 371/3/4
f 371/3/4 369/3/4 372/3/4
f 372/3/4 369/3/4 373/3/4
f 370/3/4 347/3/4 374/3/4
f 374/3/4 347/3/4 375/3/4
f 375/3/4 347/3/4 376/3/4
f 368/3/4 364/3/4 377/3/4
f 377/3/4 364/3/4 378/3/4
f 378/3/4 364/3/4 379/3/4
f 379/3/4 364/3/4 380/3/4
f 372/3/4 373/3/4 381/3/4
f 374/3/4 375/3/4 381/3/4
f 373/3/4 374/3/4 381/3/4
f 381/3/4 375/3/4 382/3/4
f 378/3/4 379/3/4 383/3/4
f 383/3/4 379/3/4 384/3/4
f 385/1/4 386/1/4 388/1/4
f 386/3/4 387/3/4 389/3/4
f 388/1/4 386/1/4 389/1/4
f 389/3/4 387/3/4 390/3/4
f 391/1/4 392/1/4 393/1/4
f 393/1/4 392/1/4 394/1/4
f 395/2/4 396/2/4 397/2/4
f 397/2/4 396/2/4 398/2/4
f 402/1/5 400/1/5 399/1/5
f 403/1/5 400/1/5 402/1/5
f 405/1/5 402/1/5 401/1/5
f 405/1/5 404/1/5 403/1/5
f 405/1/5 403/1/5 402/1/5
f 406/1/5 404/1/5 405/1/5
f 407/1/5 404/1/5 406/1/5
f 408/1/5 404/1/5 407/1/5
f 411/1/5 407/1/5 406/1/5
f 412/1/5 407/1/5 411/1/5
f 414/1/5 410/1/5 409/1/5
f 415/1/5 410/1/5 414/1/5
f 417/1/5 416/1/5 415/1/5
f 417/1/5 415/1/5 414/1/5
f 417/1/5 414/1/5 413/1/5
f 418/1/5 416/1/5 417/1/5
f 419/1/5 416/1/5 418/1/5
f 420/1/5 416/1/5 419/1/5
f 421/1/5 419/1/5 418/1/5
f 422/1/5 419/1/5 421/1/5
f 427/3/5 424/3/5 423/3/5
f 428/3/5 426/3/5 425/3/5
f 429/3/5 426/3/5 428/3/5
f 429/3/5 428/3/5 427/3/5
f 430/3/5 426/3/5 429/3/5
f 431/3/5 427/3/5 423/3/5
f 431/3/5 429/3/5 427/3/5
f 432/3/5 429/3/5 431/3/5
f 433/3/5 426/3/5 430/3/5
f 434/3/5 426/3/5 433/3/5
f 439/3/5 436/3/5 435/3/5
f 440/3/5 436/3/5 439/3/5
f 441/3/5 438/3/5 437/3/5
f 442/3/5 438/3/5 441/3/5
f 445/1/5 444/1/5 443/1/5
f 446/1/5 444/1/5 445/1/5
f 449/1/5 448/1/5 447/1/5
f 450/1/5 448/1/5 449/1/5
f 453/3/5 452/3/5 451/3/5
f 454/3/5 452/3/5 453/3/5
f 457/3/5 456/3/5 455/3/5
f 458/3/5 456/3/5 457/3/5
f 459/3/5 457/3/5 455/3/5
f 460/3/5 456/3/5 458/3/5
f 461/3/5 459/3/5 455/3/5
f 461/3/5 460/3/5 459/3/5
f 462/3/5 456/3/5 460/3/5
f 462/3/5 460/3/5 461/3/5
f 467/3/5 464/3/5 463/3/5
f 468/3/5 464/3/5 467/3/5
f 469/3/5 466/3/5 465/3/5
f 470/3/5 466/3/5 469/3/5
f 473/3/5 472/3/5 471/3/5
f 474/3/5 472/3/5 473/3/5
f 477/3/5 476/3/5 475/3/5
f 478/3/5 476/3/5 477/3/5
f 481/2/5 480/2/5 479/2/5
f 482/2/5 480/2/5 481/2/5
f 485/2/5 484/2/5 483/2/5
f 486/2/5 484/2/5 485/2/5
f 487/1/6 488/1/6 489/1/6
f 489/1/6 488/1/6 490/1/6
f 491/1/6 492/1/6 495/1/6
f 495/1/6 492/1/6 496/1/6
f 493/1/6 494/1/6 497/1/6
f 497/1/6 494/1/6 498/1/6
f 499/1/6 500/1/6 501/1/6
f 501/1/6 500/1/6 502/1/6
f 503/3/6 504/3/6 505/3/6
f 505/3/6 504/3/6 506/3/6
f 507/3/6 508/3/6 509/3/6
f 509/3/6 508/3/6 510/3/6
f 511/3/6 512/3/6 515/3/6
f 515/3/6 512/3/6 516/3/6
f 513/3/6 514/3/6 517/3/6
f 517/3/6 514/3/6 518/3/6
f 521/3/6 522/3/6 525/3/6
f 525/3/6 522/3/6 526/3/6
f 519/3/6 520/3/6 529/3/6
f 529/3/6 520/3/6 530/3/6
f 527/3/6 528/3/6 531/3/6
f 531/3/6 528/3/6 532/3/6
f 523/3/6 524/3/6 533/3/6
f 533/3/6 524/3/6 534/3/6
f 535/3/6 536/3/6 537/3/6
f 537/3/6 536/3/6 538/3/6
f 539/3/6 540/3/6 541/3/6
f 541/3/6 540/3/6 542/3/6
f 542/3/6 540/3/6 543/3/6
f 543/3/6 540/3/6 544/3/6
f 545/3/6 546/3/6 547/3/6
f 547/3/6 546/3/6 548/3/6
f 545/3/6 547/3/6 549/3/6
f 545/3/6 549/3/6 551/3/6
f 549/3/6 550/3/6 551/3/6
f 551/3/6 550/3/6 552/3/6
f 553/3/6 554/3/6 555/3/6
f 555/3/6 554/3/6 556/3/6
f 557/2/6 558/2/6 559/2/6
f 559/2/6 558/2/6 560/2/6
f 561/3/6 562/3/6 563/3/6
f 563/3/6 562/3/6 564/3/6
f 565/2/6 566/2/6 567/2/6
f 567/2/6 566/2/6 568/2/6
f 569/3/6 570/3/6 573/3/6
f 573/3/6 570/3/6 574/3/6
f 571/3/6 572/3/6 575/3/6
f 575/3/6 572/3/6 576/3/6
f 577/3/6 578/3/6 579/3/6
f 579/3/6 578/3/6 580/3/6
