%YAML 1.1
%TAG !u! tag:unity3d.com,2011:
--- !u!162 &1
EditorUserSettings:
  m_ObjectHideFlags: 0
  serializedVersion: 4
  m_ConfigSettings:
    RecentlyUsedScenePath-0:
      value: 22424703114646643d1c032815204b5f25141d24293b691c081f381fd1af1a3df5a71aecf13f33687717e1351027
      flags: 0
    RecentlyUsedScenePath-1:
      value: 22424703114646643d1c032815204b5f25141d24293b691c081f381fd1af1a3df5a71ee8f53e7f103c14ea3055701431fb1e10
      flags: 0
    RecentlyUsedScenePath-2:
      value: 22424703114646643d1c032815204b5f25141d24293b691c081f381fd1af1a3df5a71ee8f53e7f103c14ea3056701431fb1e10
      flags: 0
    RecentlyUsedScenePath-3:
      value: 22424703114646643d1c032815204b5f25141d24293b691c081f381fd1af1a3df5a71ee8f53e7f103c14ea3050701431fb1e10
      flags: 0
    RecentlyUsedScenePath-4:
      value: 22424703114646643d1c032815204b5f25141d24293b691c081f381fd1af1a3df5a71ee8f53e7f103c14ea3051701431fb1e10
      flags: 0
    RecentlyUsedScenePath-5:
      value: 22424703114646643d1c032815204b5f25141d24293b691c081f381fd1af1a3df5a71aecf13f336f7717e1351027
      flags: 0
    RecentlyUsedScenePath-6:
      value: 22424703114646643d1c032815204b5f25141d24293b691c081f381fd1af1a3df5a71aecf13f33697717e1351027
      flags: 0
    RecentlyUsedScenePath-7:
      value: 22424703114646643d1c032815204b5f25141d24293b69132c3b2200e7ec313bf6ee39e7a92f31352d1b
      flags: 0
    RecentlyUsedScenePath-8:
      value: 22424703114646643d1c032815204b5f25141d24293b691c081f381fd1af1a3df5a71ee8f53e7f103c14ea3057701431fb1e10
      flags: 0
    RecentlyUsedScenePath-9:
      value: 22424703114646643d1c032815204b5f25141d24293b691d2c20131ee7ee2176f7e93ffdfe
      flags: 0
    vcSharedLogLevel:
      value: 0d5e400f0650
      flags: 0
  m_VCAutomaticAdd: 1
  m_VCDebugCom: 0
  m_VCDebugCmd: 0
  m_VCDebugOut: 0
  m_SemanticMergeMode: 2
  m_VCShowFailedCheckout: 1
  m_VCOverwriteFailedCheckoutAssets: 1
  m_VCProjectOverlayIcons: 1
  m_VCHierarchyOverlayIcons: 1
  m_VCOtherOverlayIcons: 1
  m_VCAllowAsyncUpdate: 1
