%YAML 1.1
%TAG !u! tag:unity3d.com,2011:
--- !u!74 &7400000
AnimationClip:
  m_ObjectHideFlags: 0
  m_CorrespondingSourceObject: {fileID: 0}
  m_PrefabInstance: {fileID: 0}
  m_PrefabAsset: {fileID: 0}
  m_Name: BushRun
  serializedVersion: 6
  m_Legacy: 0
  m_Compressed: 0
  m_UseHighQualityCurve: 1
  m_RotationCurves: []
  m_CompressedRotationCurves: []
  m_EulerCurves: []
  m_PositionCurves: []
  m_ScaleCurves: []
  m_FloatCurves: []
  m_PPtrCurves:
  - curve:
    - time: 0
      value: {fileID: 21300000, guid: 558258951a7538a4c8c8a97245e74ab5, type: 3}
    - time: 0.11111111
      value: {fileID: 21300000, guid: fddd070bfe548854ca58c3858a27bfab, type: 3}
    - time: 0.22222222
      value: {fileID: 21300000, guid: e94de8038200b5a48ab314b1c1779194, type: 3}
    - time: 0.33333334
      value: {fileID: 21300000, guid: a5a13b0acdc8e3d45aa2eaee05ca77fb, type: 3}
    - time: 0.44444445
      value: {fileID: 21300000, guid: c6db99f5fdfaa5f4b96d455d81f25bb4, type: 3}
    - time: 0.5555556
      value: {fileID: 21300000, guid: 2d87863d108a3bd4e986c23bcaa15161, type: 3}
    - time: 0.6666667
      value: {fileID: 21300000, guid: ed5742fef1586d840b805ba4be9168a7, type: 3}
    - time: 0.7777778
      value: {fileID: 21300000, guid: 6c3989982670af448a84075cbb16b3e9, type: 3}
    - time: 0.8888889
      value: {fileID: 21300000, guid: 7460deb85e9cb414c80edce7ca5117e5, type: 3}
    attribute: m_Sprite
    path: 
    classID: 212
    script: {fileID: 0}
  m_SampleRate: 9
  m_WrapMode: 0
  m_Bounds:
    m_Center: {x: 0, y: 0, z: 0}
    m_Extent: {x: 0, y: 0, z: 0}
  m_ClipBindingConstant:
    genericBindings:
    - serializedVersion: 2
      path: 0
      attribute: 0
      script: {fileID: 0}
      typeID: 212
      customType: 23
      isPPtrCurve: 1
    pptrCurveMapping:
    - {fileID: 21300000, guid: 558258951a7538a4c8c8a97245e74ab5, type: 3}
    - {fileID: 21300000, guid: fddd070bfe548854ca58c3858a27bfab, type: 3}
    - {fileID: 21300000, guid: e94de8038200b5a48ab314b1c1779194, type: 3}
    - {fileID: 21300000, guid: a5a13b0acdc8e3d45aa2eaee05ca77fb, type: 3}
    - {fileID: 21300000, guid: c6db99f5fdfaa5f4b96d455d81f25bb4, type: 3}
    - {fileID: 21300000, guid: 2d87863d108a3bd4e986c23bcaa15161, type: 3}
    - {fileID: 21300000, guid: ed5742fef1586d840b805ba4be9168a7, type: 3}
    - {fileID: 21300000, guid: 6c3989982670af448a84075cbb16b3e9, type: 3}
    - {fileID: 21300000, guid: 7460deb85e9cb414c80edce7ca5117e5, type: 3}
  m_AnimationClipSettings:
    serializedVersion: 2
    m_AdditiveReferencePoseClip: {fileID: 0}
    m_AdditiveReferencePoseTime: 0
    m_StartTime: 0
    m_StopTime: 1
    m_OrientationOffsetY: 0
    m_Level: 0
    m_CycleOffset: 0
    m_HasAdditiveReferencePose: 0
    m_LoopTime: 1
    m_LoopBlend: 0
    m_LoopBlendOrientation: 0
    m_LoopBlendPositionY: 0
    m_LoopBlendPositionXZ: 0
    m_KeepOriginalOrientation: 0
    m_KeepOriginalPositionY: 1
    m_KeepOriginalPositionXZ: 0
    m_HeightFromFeet: 0
    m_Mirror: 0
  m_EditorCurves: []
  m_EulerEditorCurves: []
  m_HasGenericRootTransform: 0
  m_HasMotionFloatCurves: 0
  m_Events: []
