%YAML 1.1
%TAG !u! tag:unity3d.com,2011:
--- !u!74 &7400000
AnimationClip:
  m_ObjectHideFlags: 0
  m_CorrespondingSourceObject: {fileID: 0}
  m_PrefabInstance: {fileID: 0}
  m_PrefabAsset: {fileID: 0}
  m_Name: PlayerLand
  serializedVersion: 6
  m_Legacy: 0
  m_Compressed: 0
  m_UseHighQualityCurve: 1
  m_RotationCurves: []
  m_CompressedRotationCurves: []
  m_EulerCurves: []
  m_PositionCurves: []
  m_ScaleCurves: []
  m_FloatCurves: []
  m_PPtrCurves:
  - curve:
    - time: 0
      value: {fileID: 21300000, guid: 0e5995355738b944690eff27f00d590c, type: 3}
    - time: 0.03125
      value: {fileID: 21300000, guid: a122e527b206d8d41950283ba1e94e75, type: 3}
    - time: 0.0625
      value: {fileID: 21300000, guid: a89a83d5959886545802cdab32749ae4, type: 3}
    - time: 0.09375
      value: {fileID: 21300000, guid: 7ab08fc5cfc87e64c98eb4d2b4b3c174, type: 3}
    - time: 0.125
      value: {fileID: 21300000, guid: b19b566bedc575f41a92c8a7a0be1562, type: 3}
    - time: 0.15625
      value: {fileID: 21300000, guid: be0df681e6a84b3458552e469a5d5fef, type: 3}
    - time: 0.1875
      value: {fileID: 21300000, guid: c56ff30ef7f0c7c4d8ece60d01087bb0, type: 3}
    attribute: m_Sprite
    path: 
    classID: 212
    script: {fileID: 0}
  m_SampleRate: 32
  m_WrapMode: 0
  m_Bounds:
    m_Center: {x: 0, y: 0, z: 0}
    m_Extent: {x: 0, y: 0, z: 0}
  m_ClipBindingConstant:
    genericBindings:
    - serializedVersion: 2
      path: 0
      attribute: 0
      script: {fileID: 0}
      typeID: 212
      customType: 23
      isPPtrCurve: 1
    pptrCurveMapping:
    - {fileID: 21300000, guid: 0e5995355738b944690eff27f00d590c, type: 3}
    - {fileID: 21300000, guid: a122e527b206d8d41950283ba1e94e75, type: 3}
    - {fileID: 21300000, guid: a89a83d5959886545802cdab32749ae4, type: 3}
    - {fileID: 21300000, guid: 7ab08fc5cfc87e64c98eb4d2b4b3c174, type: 3}
    - {fileID: 21300000, guid: b19b566bedc575f41a92c8a7a0be1562, type: 3}
    - {fileID: 21300000, guid: be0df681e6a84b3458552e469a5d5fef, type: 3}
    - {fileID: 21300000, guid: c56ff30ef7f0c7c4d8ece60d01087bb0, type: 3}
  m_AnimationClipSettings:
    serializedVersion: 2
    m_AdditiveReferencePoseClip: {fileID: 0}
    m_AdditiveReferencePoseTime: 0
    m_StartTime: 0
    m_StopTime: 0.21875
    m_OrientationOffsetY: 0
    m_Level: 0
    m_CycleOffset: 0
    m_HasAdditiveReferencePose: 0
    m_LoopTime: 0
    m_LoopBlend: 0
    m_LoopBlendOrientation: 0
    m_LoopBlendPositionY: 0
    m_LoopBlendPositionXZ: 0
    m_KeepOriginalOrientation: 0
    m_KeepOriginalPositionY: 1
    m_KeepOriginalPositionXZ: 0
    m_HeightFromFeet: 0
    m_Mirror: 0
  m_EditorCurves: []
  m_EulerEditorCurves: []
  m_HasGenericRootTransform: 0
  m_HasMotionFloatCurves: 0
  m_Events: []
