%YAML 1.1
%TAG !u! tag:unity3d.com,2011:
--- !u!1 &8540796936461082912
GameObject:
  m_ObjectHideFlags: 0
  m_CorrespondingSourceObject: {fileID: 0}
  m_PrefabInstance: {fileID: 0}
  m_PrefabAsset: {fileID: 0}
  serializedVersion: 6
  m_Component:
  - component: {fileID: 8540796936461082913}
  - component: {fileID: 8540796936461082924}
  - component: {fileID: 8540796936461082915}
  - component: {fileID: 8540796936461082914}
  m_Layer: 5
  m_Name: Joystick Canvas
  m_TagString: Untagged
  m_Icon: {fileID: 0}
  m_NavMeshLayer: 0
  m_StaticEditorFlags: 0
  m_IsActive: 1
--- !u!224 &8540796936461082913
RectTransform:
  m_ObjectHideFlags: 0
  m_CorrespondingSourceObject: {fileID: 0}
  m_PrefabInstance: {fileID: 0}
  m_PrefabAsset: {fileID: 0}
  m_GameObject: {fileID: 8540796936461082912}
  m_LocalRotation: {x: 0, y: 0, z: 0, w: 1}
  m_LocalPosition: {x: 0, y: 0, z: 0}
  m_LocalScale: {x: 0, y: 0, z: 0}
  m_Children:
  - {fileID: 568920328135098635}
  m_Father: {fileID: 0}
  m_RootOrder: 0
  m_LocalEulerAnglesHint: {x: 0, y: 0, z: 0}
  m_AnchorMin: {x: 0, y: 0}
  m_AnchorMax: {x: 0, y: 0}
  m_AnchoredPosition: {x: 0, y: 0}
  m_SizeDelta: {x: 0, y: 0}
  m_Pivot: {x: 0, y: 0}
--- !u!223 &8540796936461082924
Canvas:
  m_ObjectHideFlags: 0
  m_CorrespondingSourceObject: {fileID: 0}
  m_PrefabInstance: {fileID: 0}
  m_PrefabAsset: {fileID: 0}
  m_GameObject: {fileID: 8540796936461082912}
  m_Enabled: 1
  serializedVersion: 3
  m_RenderMode: 1
  m_Camera: {fileID: 0}
  m_PlaneDistance: 100
  m_PixelPerfect: 0
  m_ReceivesEvents: 1
  m_OverrideSorting: 0
  m_OverridePixelPerfect: 0
  m_SortingBucketNormalizedSize: 0
  m_AdditionalShaderChannelsFlag: 0
  m_SortingLayerID: 0
  m_SortingOrder: 0
  m_TargetDisplay: 0
--- !u!114 &8540796936461082915
MonoBehaviour:
  m_ObjectHideFlags: 0
  m_CorrespondingSourceObject: {fileID: 0}
  m_PrefabInstance: {fileID: 0}
  m_PrefabAsset: {fileID: 0}
  m_GameObject: {fileID: 8540796936461082912}
  m_Enabled: 1
  m_EditorHideFlags: 0
  m_Script: {fileID: 11500000, guid: 0cd44c1031e13a943bb63640046fad76, type: 3}
  m_Name: 
  m_EditorClassIdentifier: 
  m_UiScaleMode: 0
  m_ReferencePixelsPerUnit: 100
  m_ScaleFactor: 1
  m_ReferenceResolution: {x: 800, y: 600}
  m_ScreenMatchMode: 0
  m_MatchWidthOrHeight: 0
  m_PhysicalUnit: 3
  m_FallbackScreenDPI: 96
  m_DefaultSpriteDPI: 96
  m_DynamicPixelsPerUnit: 1
  m_PresetInfoIsWorld: 0
--- !u!114 &8540796936461082914
MonoBehaviour:
  m_ObjectHideFlags: 0
  m_CorrespondingSourceObject: {fileID: 0}
  m_PrefabInstance: {fileID: 0}
  m_PrefabAsset: {fileID: 0}
  m_GameObject: {fileID: 8540796936461082912}
  m_Enabled: 1
  m_EditorHideFlags: 0
  m_Script: {fileID: 11500000, guid: dc42784cf147c0c48a680349fa168899, type: 3}
  m_Name: 
  m_EditorClassIdentifier: 
  m_IgnoreReversedGraphics: 1
  m_BlockingObjects: 0
  m_BlockingMask:
    serializedVersion: 2
    m_Bits: 4294967295
--- !u!1001 &8540796937380757263
PrefabInstance:
  m_ObjectHideFlags: 0
  serializedVersion: 2
  m_Modification:
    m_TransformParent: {fileID: 8540796936461082913}
    m_Modifications:
    - target: {fileID: 8170153791668043268, guid: 0d230cc8be529a542a08cb878ab14b18, type: 3}
      propertyPath: m_Pivot.x
      value: 0
      objectReference: {fileID: 0}
    - target: {fileID: 8170153791668043268, guid: 0d230cc8be529a542a08cb878ab14b18, type: 3}
      propertyPath: m_Pivot.y
      value: 0
      objectReference: {fileID: 0}
    - target: {fileID: 8170153791668043268, guid: 0d230cc8be529a542a08cb878ab14b18, type: 3}
      propertyPath: m_RootOrder
      value: 0
      objectReference: {fileID: 0}
    - target: {fileID: 8170153791668043268, guid: 0d230cc8be529a542a08cb878ab14b18, type: 3}
      propertyPath: m_AnchorMax.x
      value: 0
      objectReference: {fileID: 0}
    - target: {fileID: 8170153791668043268, guid: 0d230cc8be529a542a08cb878ab14b18, type: 3}
      propertyPath: m_AnchorMax.y
      value: 0
      objectReference: {fileID: 0}
    - target: {fileID: 8170153791668043268, guid: 0d230cc8be529a542a08cb878ab14b18, type: 3}
      propertyPath: m_AnchorMin.x
      value: 0
      objectReference: {fileID: 0}
    - target: {fileID: 8170153791668043268, guid: 0d230cc8be529a542a08cb878ab14b18, type: 3}
      propertyPath: m_AnchorMin.y
      value: 0
      objectReference: {fileID: 0}
    - target: {fileID: 8170153791668043268, guid: 0d230cc8be529a542a08cb878ab14b18, type: 3}
      propertyPath: m_SizeDelta.x
      value: 1080
      objectReference: {fileID: 0}
    - target: {fileID: 8170153791668043268, guid: 0d230cc8be529a542a08cb878ab14b18, type: 3}
      propertyPath: m_SizeDelta.y
      value: 1920
      objectReference: {fileID: 0}
    - target: {fileID: 8170153791668043268, guid: 0d230cc8be529a542a08cb878ab14b18, type: 3}
      propertyPath: m_LocalPosition.x
      value: 0
      objectReference: {fileID: 0}
    - target: {fileID: 8170153791668043268, guid: 0d230cc8be529a542a08cb878ab14b18, type: 3}
      propertyPath: m_LocalPosition.y
      value: 0
      objectReference: {fileID: 0}
    - target: {fileID: 8170153791668043268, guid: 0d230cc8be529a542a08cb878ab14b18, type: 3}
      propertyPath: m_LocalPosition.z
      value: 0
      objectReference: {fileID: 0}
    - target: {fileID: 8170153791668043268, guid: 0d230cc8be529a542a08cb878ab14b18, type: 3}
      propertyPath: m_LocalRotation.w
      value: 1
      objectReference: {fileID: 0}
    - target: {fileID: 8170153791668043268, guid: 0d230cc8be529a542a08cb878ab14b18, type: 3}
      propertyPath: m_LocalRotation.x
      value: -0
      objectReference: {fileID: 0}
    - target: {fileID: 8170153791668043268, guid: 0d230cc8be529a542a08cb878ab14b18, type: 3}
      propertyPath: m_LocalRotation.y
      value: -0
      objectReference: {fileID: 0}
    - target: {fileID: 8170153791668043268, guid: 0d230cc8be529a542a08cb878ab14b18, type: 3}
      propertyPath: m_LocalRotation.z
      value: -0
      objectReference: {fileID: 0}
    - target: {fileID: 8170153791668043268, guid: 0d230cc8be529a542a08cb878ab14b18, type: 3}
      propertyPath: m_AnchoredPosition.x
      value: 0
      objectReference: {fileID: 0}
    - target: {fileID: 8170153791668043268, guid: 0d230cc8be529a542a08cb878ab14b18, type: 3}
      propertyPath: m_AnchoredPosition.y
      value: 0
      objectReference: {fileID: 0}
    - target: {fileID: 8170153791668043268, guid: 0d230cc8be529a542a08cb878ab14b18, type: 3}
      propertyPath: m_LocalEulerAnglesHint.x
      value: 0
      objectReference: {fileID: 0}
    - target: {fileID: 8170153791668043268, guid: 0d230cc8be529a542a08cb878ab14b18, type: 3}
      propertyPath: m_LocalEulerAnglesHint.y
      value: 0
      objectReference: {fileID: 0}
    - target: {fileID: 8170153791668043268, guid: 0d230cc8be529a542a08cb878ab14b18, type: 3}
      propertyPath: m_LocalEulerAnglesHint.z
      value: 0
      objectReference: {fileID: 0}
    - target: {fileID: 8170153791668043269, guid: 0d230cc8be529a542a08cb878ab14b18, type: 3}
      propertyPath: m_Name
      value: Floating Joystick
      objectReference: {fileID: 0}
    - target: {fileID: 8170153791668043269, guid: 0d230cc8be529a542a08cb878ab14b18, type: 3}
      propertyPath: m_IsActive
      value: 1
      objectReference: {fileID: 0}
    - target: {fileID: 8170153791961219459, guid: 0d230cc8be529a542a08cb878ab14b18, type: 3}
      propertyPath: m_Color.a
      value: 0.38431373
      objectReference: {fileID: 0}
    - target: {fileID: 8170153792821263252, guid: 0d230cc8be529a542a08cb878ab14b18, type: 3}
      propertyPath: m_Sprite
      value: 
      objectReference: {fileID: 21300000, guid: 84487d73ca4b791498332d8f6858417f, type: 3}
    - target: {fileID: 8170153792821263252, guid: 0d230cc8be529a542a08cb878ab14b18, type: 3}
      propertyPath: m_Color.a
      value: 0.1764706
      objectReference: {fileID: 0}
    m_RemovedComponents: []
  m_SourcePrefab: {fileID: 100100000, guid: 0d230cc8be529a542a08cb878ab14b18, type: 3}
--- !u!224 &568920328135098635 stripped
RectTransform:
  m_CorrespondingSourceObject: {fileID: 8170153791668043268, guid: 0d230cc8be529a542a08cb878ab14b18, type: 3}
  m_PrefabInstance: {fileID: 8540796937380757263}
  m_PrefabAsset: {fileID: 0}
