%YAML 1.1
%TAG !u! tag:unity3d.com,2011:
--- !u!1001 &2891387414605800875
PrefabInstance:
  m_ObjectHideFlags: 0
  serializedVersion: 2
  m_Modification:
    m_TransformParent: {fileID: 0}
    m_Modifications:
    - target: {fileID: 1035501725715537640, guid: 4cc803c8ca638416bb54310b1d79cf69, type: 3}
      propertyPath: m_RootOrder
      value: 0
      objectReference: {fileID: 0}
    - target: {fileID: 1035501725715537640, guid: 4cc803c8ca638416bb54310b1d79cf69, type: 3}
      propertyPath: m_LocalPosition.x
      value: 0
      objectReference: {fileID: 0}
    - target: {fileID: 1035501725715537640, guid: 4cc803c8ca638416bb54310b1d79cf69, type: 3}
      propertyPath: m_LocalPosition.y
      value: 0
      objectReference: {fileID: 0}
    - target: {fileID: 1035501725715537640, guid: 4cc803c8ca638416bb54310b1d79cf69, type: 3}
      propertyPath: m_LocalPosition.z
      value: 0
      objectReference: {fileID: 0}
    - target: {fileID: 1035501725715537640, guid: 4cc803c8ca638416bb54310b1d79cf69, type: 3}
      propertyPath: m_LocalRotation.w
      value: 1
      objectReference: {fileID: 0}
    - target: {fileID: 1035501725715537640, guid: 4cc803c8ca638416bb54310b1d79cf69, type: 3}
      propertyPath: m_LocalRotation.x
      value: 0
      objectReference: {fileID: 0}
    - target: {fileID: 1035501725715537640, guid: 4cc803c8ca638416bb54310b1d79cf69, type: 3}
      propertyPath: m_LocalRotation.y
      value: 0
      objectReference: {fileID: 0}
    - target: {fileID: 1035501725715537640, guid: 4cc803c8ca638416bb54310b1d79cf69, type: 3}
      propertyPath: m_LocalRotation.z
      value: 0
      objectReference: {fileID: 0}
    - target: {fileID: 1035501725715537640, guid: 4cc803c8ca638416bb54310b1d79cf69, type: 3}
      propertyPath: m_LocalEulerAnglesHint.x
      value: 0
      objectReference: {fileID: 0}
    - target: {fileID: 1035501725715537640, guid: 4cc803c8ca638416bb54310b1d79cf69, type: 3}
      propertyPath: m_LocalEulerAnglesHint.y
      value: 0
      objectReference: {fileID: 0}
    - target: {fileID: 1035501725715537640, guid: 4cc803c8ca638416bb54310b1d79cf69, type: 3}
      propertyPath: m_LocalEulerAnglesHint.z
      value: 0
      objectReference: {fileID: 0}
    - target: {fileID: 9185689803243774493, guid: 4cc803c8ca638416bb54310b1d79cf69, type: 3}
      propertyPath: m_Name
      value: PlankResource
      objectReference: {fileID: 0}
    m_RemovedComponents: []
  m_SourcePrefab: {fileID: 100100000, guid: 4cc803c8ca638416bb54310b1d79cf69, type: 3}
--- !u!4 &305699686162013339 stripped
Transform:
  m_CorrespondingSourceObject: {fileID: 3179072629193554224, guid: 4cc803c8ca638416bb54310b1d79cf69, type: 3}
  m_PrefabInstance: {fileID: 2891387414605800875}
  m_PrefabAsset: {fileID: 0}
--- !u!1001 &5271556211801952421
PrefabInstance:
  m_ObjectHideFlags: 0
  serializedVersion: 2
  m_Modification:
    m_TransformParent: {fileID: 305699686162013339}
    m_Modifications:
    - target: {fileID: -8679921383154817045, guid: 5150e8d2c3b8f44458c06e84a4d587e1, type: 3}
      propertyPath: m_RootOrder
      value: 0
      objectReference: {fileID: 0}
    - target: {fileID: -8679921383154817045, guid: 5150e8d2c3b8f44458c06e84a4d587e1, type: 3}
      propertyPath: m_LocalPosition.x
      value: -0
      objectReference: {fileID: 0}
    - target: {fileID: -8679921383154817045, guid: 5150e8d2c3b8f44458c06e84a4d587e1, type: 3}
      propertyPath: m_LocalPosition.y
      value: 0
      objectReference: {fileID: 0}
    - target: {fileID: -8679921383154817045, guid: 5150e8d2c3b8f44458c06e84a4d587e1, type: 3}
      propertyPath: m_LocalPosition.z
      value: 0
      objectReference: {fileID: 0}
    - target: {fileID: -8679921383154817045, guid: 5150e8d2c3b8f44458c06e84a4d587e1, type: 3}
      propertyPath: m_LocalRotation.w
      value: 1
      objectReference: {fileID: 0}
    - target: {fileID: -8679921383154817045, guid: 5150e8d2c3b8f44458c06e84a4d587e1, type: 3}
      propertyPath: m_LocalRotation.x
      value: 0
      objectReference: {fileID: 0}
    - target: {fileID: -8679921383154817045, guid: 5150e8d2c3b8f44458c06e84a4d587e1, type: 3}
      propertyPath: m_LocalRotation.y
      value: -0
      objectReference: {fileID: 0}
    - target: {fileID: -8679921383154817045, guid: 5150e8d2c3b8f44458c06e84a4d587e1, type: 3}
      propertyPath: m_LocalRotation.z
      value: -0
      objectReference: {fileID: 0}
    - target: {fileID: -8679921383154817045, guid: 5150e8d2c3b8f44458c06e84a4d587e1, type: 3}
      propertyPath: m_LocalEulerAnglesHint.x
      value: 0
      objectReference: {fileID: 0}
    - target: {fileID: -8679921383154817045, guid: 5150e8d2c3b8f44458c06e84a4d587e1, type: 3}
      propertyPath: m_LocalEulerAnglesHint.y
      value: 0
      objectReference: {fileID: 0}
    - target: {fileID: -8679921383154817045, guid: 5150e8d2c3b8f44458c06e84a4d587e1, type: 3}
      propertyPath: m_LocalEulerAnglesHint.z
      value: 0
      objectReference: {fileID: 0}
    - target: {fileID: 919132149155446097, guid: 5150e8d2c3b8f44458c06e84a4d587e1, type: 3}
      propertyPath: m_Name
      value: DM_WoodPlank
      objectReference: {fileID: 0}
    m_RemovedComponents: []
  m_SourcePrefab: {fileID: 100100000, guid: 5150e8d2c3b8f44458c06e84a4d587e1, type: 3}
