%YAML 1.1
%TAG !u! tag:unity3d.com,2011:
--- !u!1045 &1
EditorBuildSettings:
  m_ObjectHideFlags: 0
  serializedVersion: 2
  m_Scenes:
  - enabled: 1
    path: Assets/_Project/Scenes/Preloader.unity
    guid: 94152b12ad103c24fb6576d703d4e2ce
  - enabled: 1
    path: Assets/_Project/Scenes/Game.unity
    guid: 74bbb166035a33a48a5e2559b44315a5
  m_configObjects: {}
