%YAML 1.1
%TAG !u! tag:unity3d.com,2011:
--- !u!221 &22100000
AnimatorOverrideController:
  m_ObjectHideFlags: 0
  m_CorrespondingSourceObject: {fileID: 0}
  m_PrefabInstance: {fileID: 0}
  m_PrefabAsset: {fileID: 0}
  m_Name: Worm
  m_Controller: {fileID: 9100000, guid: d72b5ac40e49b4997bea626b8b115c40, type: 2}
  m_Clips:
  - m_OriginalClip: {fileID: 7400000, guid: c2a8bca6ab9fc48a498e95e556c802b2, type: 2}
    m_OverrideClip: {fileID: 7400000, guid: 006f5131b1193b24c915ac19f533f8e2, type: 2}
  - m_OriginalClip: {fileID: 7400000, guid: c42c2d8b84ad34acd865c31660b286b3, type: 2}
    m_OverrideClip: {fileID: 7400000, guid: 006f5131b1193b24c915ac19f533f8e2, type: 2}
  - m_OriginalClip: {fileID: 7400000, guid: fb66f3968b518476d9c63c66fafa0c25, type: 2}
    m_OverrideClip: {fileID: 7400000, guid: 3798230aa8828c448b448eb85c10ece8, type: 2}
  - m_OriginalClip: {fileID: 7400000, guid: dbd9dae1f281f4e0aa7040be437fb6d6, type: 2}
    m_OverrideClip: {fileID: 7400000, guid: f313ef3c1df5d0e4bb56bfe88b8ba517, type: 2}
  - m_OriginalClip: {fileID: 7400000, guid: 723c409a91dc5429db70495797692aa3, type: 2}
    m_OverrideClip: {fileID: 7400000, guid: 0390946d0c3576043914ccba8cf24b19, type: 2}
