%YAML 1.1
%TAG !u! tag:unity3d.com,2011:
--- !u!1001 &858063818206576459
PrefabInstance:
  m_ObjectHideFlags: 0
  serializedVersion: 2
  m_Modification:
    m_TransformParent: {fileID: 0}
    m_Modifications:
    - target: {fileID: 753412454174656426, guid: fd681e36bcaaf0349a6aef0365bde97d, type: 3}
      propertyPath: _animator
      value: 
      objectReference: {fileID: 7359299600176655061}
    - target: {fileID: 753412454174656426, guid: fd681e36bcaaf0349a6aef0365bde97d, type: 3}
      propertyPath: _instrumentType
      value: 1
      objectReference: {fileID: 0}
    - target: {fileID: 1468808717906603949, guid: fd681e36bcaaf0349a6aef0365bde97d, type: 3}
      propertyPath: m_AnchorMax.y
      value: 0
      objectReference: {fileID: 0}
    - target: {fileID: 1468808717906603949, guid: fd681e36bcaaf0349a6aef0365bde97d, type: 3}
      propertyPath: m_AnchorMin.y
      value: 0
      objectReference: {fileID: 0}
    - target: {fileID: 1468808717906603949, guid: fd681e36bcaaf0349a6aef0365bde97d, type: 3}
      propertyPath: m_AnchoredPosition.x
      value: 0
      objectReference: {fileID: 0}
    - target: {fileID: 1468808717906603949, guid: fd681e36bcaaf0349a6aef0365bde97d, type: 3}
      propertyPath: m_AnchoredPosition.y
      value: 0
      objectReference: {fileID: 0}
    - target: {fileID: 1857286707154701704, guid: fd681e36bcaaf0349a6aef0365bde97d, type: 3}
      propertyPath: m_SizeDelta.x
      value: 12.722
      objectReference: {fileID: 0}
    - target: {fileID: 1857286707154701704, guid: fd681e36bcaaf0349a6aef0365bde97d, type: 3}
      propertyPath: m_SizeDelta.y
      value: 12.722
      objectReference: {fileID: 0}
    - target: {fileID: 1857286707154701704, guid: fd681e36bcaaf0349a6aef0365bde97d, type: 3}
      propertyPath: m_LocalPosition.z
      value: 0
      objectReference: {fileID: 0}
    - target: {fileID: 1857286707154701704, guid: fd681e36bcaaf0349a6aef0365bde97d, type: 3}
      propertyPath: m_AnchoredPosition.x
      value: 2.12
      objectReference: {fileID: 0}
    - target: {fileID: 1857286707154701704, guid: fd681e36bcaaf0349a6aef0365bde97d, type: 3}
      propertyPath: m_AnchoredPosition.y
      value: 1.91
      objectReference: {fileID: 0}
    - target: {fileID: 2915608250365272893, guid: fd681e36bcaaf0349a6aef0365bde97d, type: 3}
      propertyPath: m_AnchorMax.y
      value: 0
      objectReference: {fileID: 0}
    - target: {fileID: 2915608250365272893, guid: fd681e36bcaaf0349a6aef0365bde97d, type: 3}
      propertyPath: m_AnchorMin.y
      value: 0
      objectReference: {fileID: 0}
    - target: {fileID: 2915608250365272893, guid: fd681e36bcaaf0349a6aef0365bde97d, type: 3}
      propertyPath: m_SizeDelta.x
      value: 0
      objectReference: {fileID: 0}
    - target: {fileID: 2915608250365272893, guid: fd681e36bcaaf0349a6aef0365bde97d, type: 3}
      propertyPath: m_SizeDelta.y
      value: 0
      objectReference: {fileID: 0}
    - target: {fileID: 2915608250365272893, guid: fd681e36bcaaf0349a6aef0365bde97d, type: 3}
      propertyPath: m_AnchoredPosition.x
      value: 0
      objectReference: {fileID: 0}
    - target: {fileID: 2915608250365272893, guid: fd681e36bcaaf0349a6aef0365bde97d, type: 3}
      propertyPath: m_AnchoredPosition.y
      value: 0
      objectReference: {fileID: 0}
    - target: {fileID: 2984177958964510262, guid: fd681e36bcaaf0349a6aef0365bde97d, type: 3}
      propertyPath: m_RootOrder
      value: 0
      objectReference: {fileID: 0}
    - target: {fileID: 2984177958964510262, guid: fd681e36bcaaf0349a6aef0365bde97d, type: 3}
      propertyPath: m_LocalPosition.x
      value: 0
      objectReference: {fileID: 0}
    - target: {fileID: 2984177958964510262, guid: fd681e36bcaaf0349a6aef0365bde97d, type: 3}
      propertyPath: m_LocalPosition.y
      value: 0
      objectReference: {fileID: 0}
    - target: {fileID: 2984177958964510262, guid: fd681e36bcaaf0349a6aef0365bde97d, type: 3}
      propertyPath: m_LocalPosition.z
      value: 0
      objectReference: {fileID: 0}
    - target: {fileID: 2984177958964510262, guid: fd681e36bcaaf0349a6aef0365bde97d, type: 3}
      propertyPath: m_LocalRotation.w
      value: 1
      objectReference: {fileID: 0}
    - target: {fileID: 2984177958964510262, guid: fd681e36bcaaf0349a6aef0365bde97d, type: 3}
      propertyPath: m_LocalRotation.x
      value: 0
      objectReference: {fileID: 0}
    - target: {fileID: 2984177958964510262, guid: fd681e36bcaaf0349a6aef0365bde97d, type: 3}
      propertyPath: m_LocalRotation.y
      value: 0
      objectReference: {fileID: 0}
    - target: {fileID: 2984177958964510262, guid: fd681e36bcaaf0349a6aef0365bde97d, type: 3}
      propertyPath: m_LocalRotation.z
      value: 0
      objectReference: {fileID: 0}
    - target: {fileID: 2984177958964510262, guid: fd681e36bcaaf0349a6aef0365bde97d, type: 3}
      propertyPath: m_LocalEulerAnglesHint.x
      value: 0
      objectReference: {fileID: 0}
    - target: {fileID: 2984177958964510262, guid: fd681e36bcaaf0349a6aef0365bde97d, type: 3}
      propertyPath: m_LocalEulerAnglesHint.y
      value: 0
      objectReference: {fileID: 0}
    - target: {fileID: 2984177958964510262, guid: fd681e36bcaaf0349a6aef0365bde97d, type: 3}
      propertyPath: m_LocalEulerAnglesHint.z
      value: 0
      objectReference: {fileID: 0}
    - target: {fileID: 3126209756299895457, guid: fd681e36bcaaf0349a6aef0365bde97d, type: 3}
      propertyPath: m_AnchorMax.y
      value: 0
      objectReference: {fileID: 0}
    - target: {fileID: 3126209756299895457, guid: fd681e36bcaaf0349a6aef0365bde97d, type: 3}
      propertyPath: m_AnchorMin.y
      value: 0
      objectReference: {fileID: 0}
    - target: {fileID: 3126209756299895457, guid: fd681e36bcaaf0349a6aef0365bde97d, type: 3}
      propertyPath: m_AnchoredPosition.x
      value: 0
      objectReference: {fileID: 0}
    - target: {fileID: 3126209756299895457, guid: fd681e36bcaaf0349a6aef0365bde97d, type: 3}
      propertyPath: m_AnchoredPosition.y
      value: 0
      objectReference: {fileID: 0}
    - target: {fileID: 3595805283581547773, guid: fd681e36bcaaf0349a6aef0365bde97d, type: 3}
      propertyPath: m_Radius
      value: 1.5
      objectReference: {fileID: 0}
    - target: {fileID: 5830501117049853933, guid: fd681e36bcaaf0349a6aef0365bde97d, type: 3}
      propertyPath: m_AnchorMax.y
      value: 0
      objectReference: {fileID: 0}
    - target: {fileID: 5830501117049853933, guid: fd681e36bcaaf0349a6aef0365bde97d, type: 3}
      propertyPath: m_AnchorMin.y
      value: 0
      objectReference: {fileID: 0}
    - target: {fileID: 5830501117049853933, guid: fd681e36bcaaf0349a6aef0365bde97d, type: 3}
      propertyPath: m_SizeDelta.x
      value: 0
      objectReference: {fileID: 0}
    - target: {fileID: 5830501117049853933, guid: fd681e36bcaaf0349a6aef0365bde97d, type: 3}
      propertyPath: m_SizeDelta.y
      value: 0
      objectReference: {fileID: 0}
    - target: {fileID: 5830501117049853933, guid: fd681e36bcaaf0349a6aef0365bde97d, type: 3}
      propertyPath: m_AnchoredPosition.x
      value: 0
      objectReference: {fileID: 0}
    - target: {fileID: 5830501117049853933, guid: fd681e36bcaaf0349a6aef0365bde97d, type: 3}
      propertyPath: m_AnchoredPosition.y
      value: 0
      objectReference: {fileID: 0}
    - target: {fileID: 6266223505084321351, guid: fd681e36bcaaf0349a6aef0365bde97d, type: 3}
      propertyPath: m_Size.x
      value: 1.508854
      objectReference: {fileID: 0}
    - target: {fileID: 6266223505084321351, guid: fd681e36bcaaf0349a6aef0365bde97d, type: 3}
      propertyPath: m_Size.z
      value: 1.3445637
      objectReference: {fileID: 0}
    - target: {fileID: 6266223505084321351, guid: fd681e36bcaaf0349a6aef0365bde97d, type: 3}
      propertyPath: m_Center.y
      value: 0.5
      objectReference: {fileID: 0}
    - target: {fileID: 6266223505084321351, guid: fd681e36bcaaf0349a6aef0365bde97d, type: 3}
      propertyPath: m_Center.z
      value: 0
      objectReference: {fileID: 0}
    - target: {fileID: 6627927949472486264, guid: fd681e36bcaaf0349a6aef0365bde97d, type: 3}
      propertyPath: m_Name
      value: PickTool
      objectReference: {fileID: 0}
    - target: {fileID: 6832444238383608187, guid: fd681e36bcaaf0349a6aef0365bde97d, type: 3}
      propertyPath: m_AnchorMax.y
      value: 0
      objectReference: {fileID: 0}
    - target: {fileID: 6832444238383608187, guid: fd681e36bcaaf0349a6aef0365bde97d, type: 3}
      propertyPath: m_AnchorMin.y
      value: 0
      objectReference: {fileID: 0}
    - target: {fileID: 6832444238383608187, guid: fd681e36bcaaf0349a6aef0365bde97d, type: 3}
      propertyPath: m_SizeDelta.x
      value: 0
      objectReference: {fileID: 0}
    - target: {fileID: 6832444238383608187, guid: fd681e36bcaaf0349a6aef0365bde97d, type: 3}
      propertyPath: m_SizeDelta.y
      value: 0
      objectReference: {fileID: 0}
    - target: {fileID: 6832444238383608187, guid: fd681e36bcaaf0349a6aef0365bde97d, type: 3}
      propertyPath: m_AnchoredPosition.x
      value: 0
      objectReference: {fileID: 0}
    - target: {fileID: 6832444238383608187, guid: fd681e36bcaaf0349a6aef0365bde97d, type: 3}
      propertyPath: m_AnchoredPosition.y
      value: 0
      objectReference: {fileID: 0}
    m_RemovedComponents:
    - {fileID: 8417826153081771704, guid: fd681e36bcaaf0349a6aef0365bde97d, type: 3}
  m_SourcePrefab: {fileID: 100100000, guid: fd681e36bcaaf0349a6aef0365bde97d, type: 3}
--- !u!4 &1505099969308566857 stripped
Transform:
  m_CorrespondingSourceObject: {fileID: 2236956464839645698, guid: fd681e36bcaaf0349a6aef0365bde97d, type: 3}
  m_PrefabInstance: {fileID: 858063818206576459}
  m_PrefabAsset: {fileID: 0}
--- !u!1001 &8535316965165806324
PrefabInstance:
  m_ObjectHideFlags: 0
  serializedVersion: 2
  m_Modification:
    m_TransformParent: {fileID: 1505099969308566857}
    m_Modifications:
    - target: {fileID: -8679921383154817045, guid: c692f93c122634dbbbbb1294716b2e6b, type: 3}
      propertyPath: m_RootOrder
      value: 0
      objectReference: {fileID: 0}
    - target: {fileID: -8679921383154817045, guid: c692f93c122634dbbbbb1294716b2e6b, type: 3}
      propertyPath: m_LocalScale.x
      value: 0.6
      objectReference: {fileID: 0}
    - target: {fileID: -8679921383154817045, guid: c692f93c122634dbbbbb1294716b2e6b, type: 3}
      propertyPath: m_LocalScale.y
      value: 0.6
      objectReference: {fileID: 0}
    - target: {fileID: -8679921383154817045, guid: c692f93c122634dbbbbb1294716b2e6b, type: 3}
      propertyPath: m_LocalScale.z
      value: 0.6
      objectReference: {fileID: 0}
    - target: {fileID: -8679921383154817045, guid: c692f93c122634dbbbbb1294716b2e6b, type: 3}
      propertyPath: m_LocalPosition.x
      value: 0
      objectReference: {fileID: 0}
    - target: {fileID: -8679921383154817045, guid: c692f93c122634dbbbbb1294716b2e6b, type: 3}
      propertyPath: m_LocalPosition.y
      value: 0
      objectReference: {fileID: 0}
    - target: {fileID: -8679921383154817045, guid: c692f93c122634dbbbbb1294716b2e6b, type: 3}
      propertyPath: m_LocalPosition.z
      value: 0
      objectReference: {fileID: 0}
    - target: {fileID: -8679921383154817045, guid: c692f93c122634dbbbbb1294716b2e6b, type: 3}
      propertyPath: m_LocalRotation.w
      value: 0
      objectReference: {fileID: 0}
    - target: {fileID: -8679921383154817045, guid: c692f93c122634dbbbbb1294716b2e6b, type: 3}
      propertyPath: m_LocalRotation.x
      value: 0
      objectReference: {fileID: 0}
    - target: {fileID: -8679921383154817045, guid: c692f93c122634dbbbbb1294716b2e6b, type: 3}
      propertyPath: m_LocalRotation.y
      value: 1
      objectReference: {fileID: 0}
    - target: {fileID: -8679921383154817045, guid: c692f93c122634dbbbbb1294716b2e6b, type: 3}
      propertyPath: m_LocalRotation.z
      value: 0
      objectReference: {fileID: 0}
    - target: {fileID: -8679921383154817045, guid: c692f93c122634dbbbbb1294716b2e6b, type: 3}
      propertyPath: m_LocalEulerAnglesHint.x
      value: 0
      objectReference: {fileID: 0}
    - target: {fileID: -8679921383154817045, guid: c692f93c122634dbbbbb1294716b2e6b, type: 3}
      propertyPath: m_LocalEulerAnglesHint.y
      value: 180
      objectReference: {fileID: 0}
    - target: {fileID: -8679921383154817045, guid: c692f93c122634dbbbbb1294716b2e6b, type: 3}
      propertyPath: m_LocalEulerAnglesHint.z
      value: 0
      objectReference: {fileID: 0}
    - target: {fileID: 919132149155446097, guid: c692f93c122634dbbbbb1294716b2e6b, type: 3}
      propertyPath: m_Name
      value: DM_Pike_Equip
      objectReference: {fileID: 0}
    - target: {fileID: 9019549132467966621, guid: c692f93c122634dbbbbb1294716b2e6b, type: 3}
      propertyPath: m_BlendShapeWeights.Array.size
      value: 1
      objectReference: {fileID: 0}
    - target: {fileID: 9019549132467966621, guid: c692f93c122634dbbbbb1294716b2e6b, type: 3}
      propertyPath: m_BlendShapeWeights.Array.data[0]
      value: 0
      objectReference: {fileID: 0}
    m_RemovedComponents: []
  m_SourcePrefab: {fileID: 100100000, guid: c692f93c122634dbbbbb1294716b2e6b, type: 3}
--- !u!1 &8841375717882040229 stripped
GameObject:
  m_CorrespondingSourceObject: {fileID: 919132149155446097, guid: c692f93c122634dbbbbb1294716b2e6b, type: 3}
  m_PrefabInstance: {fileID: 8535316965165806324}
  m_PrefabAsset: {fileID: 0}
--- !u!95 &7359299600176655061
Animator:
  serializedVersion: 3
  m_ObjectHideFlags: 0
  m_CorrespondingSourceObject: {fileID: 0}
  m_PrefabInstance: {fileID: 0}
  m_PrefabAsset: {fileID: 0}
  m_GameObject: {fileID: 8841375717882040229}
  m_Enabled: 1
  m_Avatar: {fileID: 0}
  m_Controller: {fileID: 9100000, guid: c7b30ad16fc444028975516644955bb8, type: 2}
  m_CullingMode: 0
  m_UpdateMode: 0
  m_ApplyRootMotion: 0
  m_LinearVelocityBlending: 0
  m_WarningMessage: 
  m_HasTransformHierarchy: 1
  m_AllowConstantClipSamplingOptimization: 1
  m_KeepAnimatorControllerStateOnDisable: 0
