%YAML 1.1
%TAG !u! tag:unity3d.com,2011:
--- !u!114 &11400000
MonoBehaviour:
  m_ObjectHideFlags: 0
  m_CorrespondingSourceObject: {fileID: 0}
  m_PrefabInstance: {fileID: 0}
  m_PrefabAsset: {fileID: 0}
  m_GameObject: {fileID: 0}
  m_Enabled: 1
  m_EditorHideFlags: 0
  m_Script: {fileID: 11500000, guid: de0f592516c54a4b886ca93c600beec1, type: 3}
  m_Name: Axe_4
  m_EditorClassIdentifier: 
  _sprite: {fileID: 21300000, guid: 102ed84e22fe7484cb0406d2bd3e0e5b, type: 3}
  _prefab: {fileID: 2793848922480686021, guid: 477a725e0134b9c49bb8082151e9801c, type: 3}
  _damage: 5
  _increaseAmounts: 01000000
  _resourceAmountProperties:
  - gameResourceType: 4
    _amount: 200
  - gameResourceType: 2
    _amount: 200
  - gameResourceType: 5
    _amount: 500
  _trailColor: {r: 0.7529412, g: 0.5372549, b: 0.22352941, a: 1}
